Fluorine nitrate
- Formula: FNO3
- Molecular weight: 81.0033
- IUPAC Standard InChIKey: VHFBTKQOIBRGQP-UHFFFAOYSA-N
- CAS Registry Number: 7789-26-6
- Chemical structure:
View 3d structure (requires JavaScript / HTML 5) - Permanent link for this species. Use this link for bookmarking this species for future reference.

Gas phase thermochemistry data

Quantity | Value | Units | Method | Reference | Comment |
---|---|---|---|---|---|
ΔfH°gas | 10.46 | kJ/mol | Review | Chase, 1998 | Data last reviewed in March, 1963 |
Quantity | Value | Units | Method | Reference | Comment |
S°gas,1 bar | 292.93 | J/mol*K | Review | Chase, 1998 | Data last reviewed in March, 1963 |
Gas Phase Heat Capacity (Shomate Equation)
Cp° = A + B*t + C*t2 + D*t3 +
E/t2
H° − H°298.15= A*t + B*t2/2 +
C*t3/3 + D*t4/4 − E/t + F − H
S° = A*ln(t) + B*t + C*t2/2 + D*t3/3 −
E/(2*t2) + G
Cp = heat capacity (J/mol*K)
H° = standard enthalpy (kJ/mol)
S° = standard entropy (J/mol*K)
t = temperature (K) / 1000.
View plot Requires a JavaScript / HTML 5 canvas capable browser.
Temperature (K) | 298. to 1100. | 1100. to 6000. |
---|---|---|
A | 31.64016 | 106.1380 |
B | 160.5564 | 1.081908 |
C | -133.7537 | -0.217921 |
D | 40.67179 | 0.015041 |
E | -0.310670 | -8.304028 |
F | -6.052282 | -43.14792 |
G | 287.1847 | 389.4522 |
H | 10.46000 | 10.46000 |
Reference | Chase, 1998 | Chase, 1998 |
Comment | Data last reviewed in March, 1963 | Data last reviewed in March, 1963 |

Phase change data

Data compiled by: Thermodynamics Research Center, NIST Boulder Laboratories, Chris Muzny director
Quantity | Value | Units | Method | Reference | Comment |
---|---|---|---|---|---|
Tboil | 231. | K | N/A | Yost and Beerbower, 1935 | Uncertainty assigned by TRC = 4. K |

Vibrational and/or electronic energy levels

Data compiled by: Marilyn E. Jacox
State: X
Additional references: Jacox, 1998, page 302

References

Chase, 1998
Chase, M.W., Jr.,
NIST-JANAF Themochemical Tables, Fourth Edition,
J. Phys. Chem. Ref. Data, Monograph 9, 1998, 1-1951. [all data]
Yost and Beerbower, 1935
Yost, D.M.; Beerbower, A.,
The Reaction of Cluorine with Nitric Acid and With Solid Potassium Nitrate to Form NO3F,
J. Am. Chem. Soc., 1935, 57, 782. [all data]
Arvia, Cafferata, et al., 1963
Arvia, A.J.; Cafferata, L.F.R.; Schumacher, H.J.,
Das Infrarotspektrum und die Struktur von NO3Cl und NO3F,
Chem. Ber., 1963, 96, 5, 1187, https://doi.org/10.1002/cber.19630960502
. [all data]
Miller, Bernitt, et al., 1967
Miller, R.H.; Bernitt, D.L.; Hisatsune, I.C.,
Spectrochim. Acta, 1967, 23A, 223. [all data]
Shamir, Yellin, et al., 1974
Shamir, J.; Yellin, D.; Claassen, H.H.,
Isr. J. Chem., 1974, 12, 1015. [all data]
Casper, Dixon, et al., 1994
Casper, B.; Dixon, D.A.; Mack, H.-G.; Ulic, S.E.; Willner, H.; Oberhammer, H.,
Molecular Structure of Fluorine Nitrate: Dangerous for Experiment and Theory,
J. Am. Chem. Soc., 1994, 116, 18, 8317, https://doi.org/10.1021/ja00097a044
. [all data]
Jacox, 1998
Jacox, M.E.,
Vibrational and electronic energy levels of polyatomic transient molecules: supplement A,
J. Phys. Chem. Ref. Data, 1998, 27, 2, 115-393, https://doi.org/10.1063/1.556017
. [all data]