nitrosyl fluoride
- Formula: FNO
- Molecular weight: 49.0045
- IUPAC Standard InChIKey: ZEIYBPGWHWECHV-UHFFFAOYSA-N
- CAS Registry Number: 7789-25-5
- Chemical structure:
View 3d structure (requires JavaScript / HTML 5) - Permanent link for this species. Use this link for bookmarking this species for future reference.

Gas phase thermochemistry data

Quantity | Value | Units | Method | Reference | Comment |
---|---|---|---|---|---|
ΔfH°gas | -65.69 | kJ/mol | Review | Chase, 1998 | Data last reviewed in June, 1961 |
Quantity | Value | Units | Method | Reference | Comment |
S°gas,1 bar | 248.08 | J/mol*K | Review | Chase, 1998 | Data last reviewed in June, 1961 |
Gas Phase Heat Capacity (Shomate Equation)
Cp° = A + B*t + C*t2 + D*t3 +
E/t2
H° − H°298.15= A*t + B*t2/2 +
C*t3/3 + D*t4/4 − E/t + F − H
S° = A*ln(t) + B*t + C*t2/2 + D*t3/3 −
E/(2*t2) + G
Cp = heat capacity (J/mol*K)
H° = standard enthalpy (kJ/mol)
S° = standard entropy (J/mol*K)
t = temperature (K) / 1000.
View plot Requires a JavaScript / HTML 5 canvas capable browser.
Temperature (K) | 298. to 1000. | 1000. to 6000. |
---|---|---|
A | 32.62143 | 56.25472 |
B | 42.23497 | 1.109246 |
C | -28.49455 | -0.228219 |
D | 7.259868 | 0.016019 |
E | -0.135657 | -3.709208 |
F | -77.51027 | -91.76809 |
G | 275.4059 | 303.0237 |
H | -65.68922 | -65.68922 |
Reference | Chase, 1998 | Chase, 1998 |
Comment | Data last reviewed in June, 1961 | Data last reviewed in June, 1961 |

Gas phase ion energetics data

Data evaluated as indicated in comments:
L - Sharon G. Lias
Data compiled as indicated in comments:
LLK - Sharon G. Lias, Rhoda D. Levin, and Sherif A. Kafafi
RDSH - Henry M. Rosenstock, Keith Draxl, Bruce W. Steiner, and John T. Herron
Quantity | Value | Units | Method | Reference | Comment |
---|---|---|---|---|---|
IE (evaluated) | 12.65 ± 0.05 | eV | N/A | N/A | L |
Ionization energy determinations
IE (eV) | Method | Reference | Comment |
---|---|---|---|
12.63 ± 0.03 | PE | Alderdice and Dixon, 1977 | LLK |
12.66 | PE | Frost, Lee, et al., 1975 | LLK |
Appearance energy determinations
Ion | AE (eV) | Other Products | Method | Reference | Comment |
---|---|---|---|---|---|
NO+ | 11.6 ± 0.2 | F | EI | Cristy and Mamantov, 1970 | RDSH |

References

Chase, 1998
Chase, M.W., Jr.,
NIST-JANAF Themochemical Tables, Fourth Edition,
J. Phys. Chem. Ref. Data, Monograph 9, 1998, 1-1951. [all data]
Alderdice and Dixon, 1977
Alderdice, D.S.; Dixon, R.N.,
Photoelectron spectra of nitrosyl halides,
J. Chem. Soc. Faraday Trans. 2, 1977, 73, 245. [all data]
Frost, Lee, et al., 1975
Frost, D.C.; Lee, S.T.; McDowell, C.A.; Westwood, N.P.C.,
Photoelectron spectroscopic studies of some nitrosyl and nitryl halides nitric acid,
J. Electron Spectrosc. Relat. Phenom., 1975, 7, 331. [all data]
Cristy and Mamantov, 1970
Cristy, S.S.; Mamantov, G.,
Cryogenic mass spectrometry of reactive fluorine-containing species. I. The mass spectra of sulfur hexafluoride, chlorine trifluoride, chlorine monofluoride, nitrosyl fluoride and tetrafluorohydrazine,
Intern. J. Mass Spectrom. Ion Phys., 1970, 5, 309. [all data]