Lithium fluoride
- Formula: FLi
- Molecular weight: 25.939
- IUPAC Standard InChIKey: PQXKHYXIUOZZFA-UHFFFAOYSA-M
- CAS Registry Number: 7789-24-4
- Chemical structure:
View 3d structure (requires JavaScript / HTML 5) - Permanent link for this species. Use this link for bookmarking this species for future reference.

Gas phase thermochemistry data

Quantity | Value | Units | Method | Reference | Comment |
---|---|---|---|---|---|
ΔfH°gas | -340.79 | kJ/mol | Review | Chase, 1998 | Data last reviewed in December, 1968 |
Quantity | Value | Units | Method | Reference | Comment |
S°gas,1 bar | 200.21 | J/mol*K | Review | Chase, 1998 | Data last reviewed in December, 1968 |
Gas Phase Heat Capacity (Shomate Equation)
Cp° = A + B*t + C*t2 + D*t3 +
E/t2
H° − H°298.15= A*t + B*t2/2 +
C*t3/3 + D*t4/4 − E/t + F − H
S° = A*ln(t) + B*t + C*t2/2 + D*t3/3 −
E/(2*t2) + G
Cp = heat capacity (J/mol*K)
H° = standard enthalpy (kJ/mol)
S° = standard entropy (J/mol*K)
t = temperature (K) / 1000.
View plot Requires a JavaScript / HTML 5 canvas capable browser.
Temperature (K) | 3000. to 6000. |
---|---|
A | 35.08832 |
B | 2.506677 |
C | -0.517285 |
D | 0.043750 |
E | -0.427308 |
F | -352.7878 |
G | 239.5436 |
H | -340.7872 |
Reference | Chase, 1998 |
Comment | Data last reviewed in December, 1968 |

Condensed phase thermochemistry data

Quantity | Value | Units | Method | Reference | Comment |
---|---|---|---|---|---|
ΔfH°liquid | -598.65 | kJ/mol | Review | Chase, 1998 | Data last reviewed in December, 1968 |
Quantity | Value | Units | Method | Reference | Comment |
S°liquid,1 bar | 42.96 | J/mol*K | Review | Chase, 1998 | Data last reviewed in December, 1968 |
Quantity | Value | Units | Method | Reference | Comment |
ΔfH°solid | -616.93 | kJ/mol | Review | Chase, 1998 | Data last reviewed in December, 1968 |
Quantity | Value | Units | Method | Reference | Comment |
S°solid | 35.73 | J/mol*K | Review | Chase, 1998 | Data last reviewed in December, 1968 |
Liquid Phase Heat Capacity (Shomate Equation)
Cp° = A + B*t + C*t2 + D*t3 +
E/t2
H° − H°298.15= A*t + B*t2/2 +
C*t3/3 + D*t4/4 − E/t + F − H
S° = A*ln(t) + B*t + C*t2/2 + D*t3/3 −
E/(2*t2) + G
Cp = heat capacity (J/mol*K)
H° = standard enthalpy (kJ/mol)
S° = standard entropy (J/mol*K)
t = temperature (K) / 1000.
View plot Requires a JavaScript / HTML 5 canvas capable browser.
Temperature (K) | 1121.3 to 3000. |
---|---|
A | 64.18298 |
B | 4.195423×10-11 |
C | -2.302271×10-11 |
D | 3.924242×10-12 |
E | 1.150237×10-12 |
F | -617.7885 |
G | 120.6335 |
H | -598.6509 |
Reference | Chase, 1998 |
Comment | Data last reviewed in December, 1968 |
Solid Phase Heat Capacity (Shomate Equation)
Cp° = A + B*t + C*t2 + D*t3 +
E/t2
H° − H°298.15= A*t + B*t2/2 +
C*t3/3 + D*t4/4 − E/t + F − H
S° = A*ln(t) + B*t + C*t2/2 + D*t3/3 −
E/(2*t2) + G
Cp = heat capacity (J/mol*K)
H° = standard enthalpy (kJ/mol)
S° = standard entropy (J/mol*K)
t = temperature (K) / 1000.
View plot Requires a JavaScript / HTML 5 canvas capable browser.
Temperature (K) | 298. to 1121.3 |
---|---|
A | 41.75837 |
B | 18.71110 |
C | 0.693674 |
D | -0.992621 |
E | -0.487055 |
F | -631.8342 |
G | 77.92072 |
H | -616.9308 |
Reference | Chase, 1998 |
Comment | Data last reviewed in December, 1968 |

Gas phase ion energetics data

Data compiled as indicated in comments:
RDSH - Henry M. Rosenstock, Keith Draxl, Bruce W. Steiner, and John T. Herron
LL - Sharon G. Lias and Joel F. Liebman
B - John E. Bartmess
Electron affinity determinations
EA (eV) | Method | Reference | Comment |
---|---|---|---|
>1.34997 | EIAE | Ebinghaus, 1964 | From (LiF)2; G3MP2B3 calculations indicate an EA of ca.0.5 eV; B |
Ionization energy determinations
IE (eV) | Method | Reference | Comment |
---|---|---|---|
11.3 | EI | Berkowitz, Tasman, et al., 1962 | RDSH |
Appearance energy determinations
Ion | AE (eV) | Other Products | Method | Reference | Comment |
---|---|---|---|---|---|
Li+ | 11.40 | F | EI | Veljkovic, Neskovic, et al., 1993 | LL |
Li+ | 11.5 | F | EI | Berkowitz, Tasman, et al., 1962 | RDSH |
Li+ | ~12. | F | EI | Porter and Schoonmaker, 1958 | RDSH |

Phase change data

Data compiled by: William E. Acree, Jr., James S. Chickos
Enthalpy of sublimation
ΔsubH (kJ/mol) | Temperature (K) | Reference | Comment |
---|---|---|---|
268.2 ± 4.2 | 1073. to 1121. | Scheffee and Margrave, 1959 | See also Eisenstadt, Rothberg, et al., 1958. |
267.8 ± 4.2 | 957. to 1113. | Porter and Schoonmaker, 1958 |

References

Chase, 1998
Chase, M.W., Jr.,
NIST-JANAF Themochemical Tables, Fourth Edition,
J. Phys. Chem. Ref. Data, Monograph 9, 1998, 1-1951. [all data]
Ebinghaus, 1964
Ebinghaus, H.Z.,
Negative Ionen aus Alkalihalogeniden und Electronenaffinitaten der Alkalimetalle und Alkalihalogenide,
Z. Naturfor., 1964, 19A, 727. [all data]
Berkowitz, Tasman, et al., 1962
Berkowitz, J.; Tasman, H.A.; Chupka, W.A.,
Double-oven experiments with lithium halide vapors,
J. Chem. Phys., 1962, 36, 2170. [all data]
Veljkovic, Neskovic, et al., 1993
Veljkovic, M.V.; Neskovic, O.M.; Miletic, M.B.; Zmbov, K.F.,
Mass spectrometric study of ionization and fragmentation of lithium fluoride vapor by electron impact,
J. Serb. Chem. Soc., 1993, 58, 101. [all data]
Porter and Schoonmaker, 1958
Porter, R.F.; Schoonmaker, R.C.,
Mass spectrometric study of the vaporization of LiF, NaF, and LiF-NaF mixtures,
J. Chem. Phys., 1958, 29, 1070. [all data]