caesium nitrate
- Formula: CsNO3
- Molecular weight: 194.9104
- IUPAC Standard InChIKey: NLSCHDZTHVNDCP-UHFFFAOYSA-N
- CAS Registry Number: 7789-18-6
- Chemical structure:
View 3d structure (requires JavaScript / HTML 5) - Other names: Cesium nitrate

Gas phase ion energetics data

Data compiled by: Sharon G. Lias, Rhoda D. Levin, and Sherif A. Kafafi
Ionization energy determinations
IE (eV) | Method | Reference | Comment |
---|---|---|---|
8.78 ± 0.06 | PE | Bowling, Sherrod, et al., 1978 | Vertical value |
Appearance energy determinations
Ion | AE (eV) | Other Products | Method | Reference | Comment |
---|---|---|---|---|---|
Cs+ | 10.5 ± 0.5 | ? | EI | Ames, Wang, et al., 1973 |

References

Bowling, Sherrod, et al., 1978
Bowling, R.A.; Sherrod, R.E.; Bloor, J.E.; Allen, J.D., Jr.; Schweitzer, G.K.,
He I photoelectron spectra of gaseous alkali nitrates,
Inorg. Chem., 1978, 17, 3418. [all data]
Ames, Wang, et al., 1973
Ames, L.L.; Wang, J.L.-F.; Margrave, J.L.,
The vaporization of cesium nitrate,
Inorg. Nucl. Chem. Lett., 1973, 9, 1243. [all data]