bromine trifluoride
- Formula: BrF3
- Molecular weight: 136.899
- CAS Registry Number: 7787-71-5

Phase change data

Data compiled as indicated in comments:
TRC - Thermodynamics Research Center, NIST Boulder Laboratories, Chris Muzny director
AC - William E. Acree, Jr., James S. Chickos
Quantity | Value | Units | Method | Reference | Comment |
---|---|---|---|---|---|
Tboil | 398.95 | K | N/A | Stein, Vogel, et al., 1954 | Uncertainty assigned by TRC = 0.5 K; TRC |
Quantity | Value | Units | Method | Reference | Comment |
Tfus | 8.8 | K | N/A | Stein, Vogel, et al., 1954 | Uncertainty assigned by TRC = 0.5 K; TRC |
Enthalpy of vaporization
ΔvapH (kJ/mol) | Temperature (K) | Reference | Comment |
---|---|---|---|
45.9 | 326. | Oliver and Grisard, 1952 | Based on data from 311. to 428. K.; AC |

Gas phase ion energetics data

Data compiled as indicated in comments:
LLK - Sharon G. Lias, Rhoda D. Levin, and Sherif A. Kafafi
RDSH - Henry M. Rosenstock, Keith Draxl, Bruce W. Steiner, and John T. Herron
Ionization energy determinations
IE (eV) | Method | Reference | Comment |
---|---|---|---|
12.15 ± 0.04 | PE | DeKock, Higginson, et al., 1972 | LLK |
12.9 ± 0.3 | EI | Irsa and Friedman, 1958 | RDSH |
Appearance energy determinations
Ion | AE (eV) | Other Products | Method | Reference | Comment |
---|---|---|---|---|---|
BrF2+ | 13.5 ± 0.3 | F | EI | Irsa and Friedman, 1958 | RDSH |

Vibrational and/or electronic energy levels

Data compiled by: Takehiko Shimanouchi

Symmetry:   C     Symmetry Number σ = 2

 Sym.   No   Approximate   Selected Freq.  Infrared   Raman   Comments
 Species   type of mode   Value   Rating   Value  Phase  Value  Phase

a1 1 BrF str 675  C 675 S gas 675 S p gas
a1 2 BrF2 s-str 552  C 552 W gas 552 VS p gas
a1 3 BrF2 ip-deform 242  C 242 S gas 233 W p gas OV6)
b1 4 BrF2 a-str 614  C 614 VS gas 612 VW gas
b1 5 BrF2 ip-deform 350  C 350 VW gas
b2 6 BrF2 op-deform 242  D 242 S gas OV3)

Source: Shimanouchi, 1972

References

Stein, Vogel, et al., 1954
Stein, L.; Vogel, R.C.; Ludewig, W.H.,
Partial Molal Volumes and Molar Refractions of the System Bromine Trifluoride-Bromine Pentafluoride,
J. Am. Chem. Soc., 1954, 76, 4287-9. [all data]
Oliver and Grisard, 1952
Oliver, George D.; Grisard, J.W.,
Thermal Data, Vapor Pressure and Entropy of Bromine Trifluoride 1,
J. Am. Chem. Soc., 1952, 74, 11, 2705-2707, https://doi.org/10.1021/ja01131a003
. [all data]
DeKock, Higginson, et al., 1972
DeKock, R.L.; Higginson, B.R.; Lloyd, D.R.; Breeze, A.; Cruickshank, D.W.J.; Armstrong, D.R.,
Photoelectron spectra of halides. V. Experimental theoretical study of the electronic structures of ClF, ClF3, BrF and BrF3,
Mol. Phys., 1972, 24, 1059. [all data]
Irsa and Friedman, 1958
Irsa, A.P.; Friedman, L.,
Mass spectra of halogen fluorides,
J. Inorg. Nucl. Chem., 1958, 6, 77. [all data]