bismuth trichloride
- Formula: BiCl3
- Molecular weight: 315.339
- CAS Registry Number: 7787-60-2

Phase change data

Data compiled as indicated in comments:
AC - William E. Acree, Jr., James S. Chickos
Antoine Equation Parameters
log10(P) = A − (B / (T + C))
P = vapor pressure (bar)
T = temperature (K)
View plot Requires a JavaScript / HTML 5 canvas capable browser.
Temperature (K) | A | B | C | Reference | Comment |
---|---|---|---|---|---|
503.7 to 710.6 | 5.66968 | 4143.046 | 19.221 | Yanai, Watanabe, et al., 1973 | Coefficents calculated by NIST from author's data. |
Enthalpy of sublimation
ΔsubH (kJ/mol) | Temperature (K) | Method | Reference | Comment |
---|---|---|---|---|
124.7 | 371. to 468. | ME | Cubicciotti, 1966 | See also Darnell and Yosim, 1959.; AC |
118.8 ± 0.4 | 420. | ME | Darnell and Yosim, 1959 | Based on data from 371. to 468. K.; AC |

Gas phase ion energetics data

Data compiled by: Sharon G. Lias, John E. Bartmess, Joel F. Liebman, John L. Holmes, Rhoda D. Levin, and W. Gary Mallard
Ionization energy determinations
IE (eV) | Method | Reference | Comment |
---|---|---|---|
11.2 ± 0.1 | EI | Ozgen, 1983 | |
10.4 | PE | Novak and Potts, 1983 | |
10.98 | PE | Novak and Potts, 1983 | Vertical value |
Appearance energy determinations
Ion | AE (eV) | Other Products | Method | Reference | Comment |
---|---|---|---|---|---|
BiCl+ | 12.2 ± 0.1 | 2Cl/Cl2 | EI | Ozgen, 1983 | |
BiCl2+ | 11.6 ± 0.1 | Cl | EI | Ozgen, 1983 |

Reaction thermochemistry data

Data compiled by: John E. Bartmess
Individual Reactions
+ BiCl3 = BiCl4-
By formula: Cl- + BiCl3 = BiCl4-
Quantity | Value | Units | Method | Reference | Comment |
---|---|---|---|---|---|
ΔrH° | 36.6 ± 3.6 | kcal/mol | CIDT | Walker, Check, et al., 2002 | gas phase |

Ion clustering data

Data compiled by: John E. Bartmess
Clustering reactions
+ BiCl3 = BiCl4-
By formula: Cl- + BiCl3 = BiCl4-
Quantity | Value | Units | Method | Reference | Comment |
---|---|---|---|---|---|
ΔrH° | 36.6 ± 3.6 | kcal/mol | CIDT | Walker, Check, et al., 2002 | gas phase |

References

Yanai, Watanabe, et al., 1973
Yanai, M.; Watanabe, F.; Saeki, Y.,
The Vapor Pressure of Bismuth Trichloride,
J. Less-Common Met., 1973, 33, 3, 387-389, https://doi.org/10.1016/0022-5088(73)90192-6
. [all data]
Cubicciotti, 1966
Cubicciotti, Daniel,
A New Σ-Plot Treatment of Equilibrium Data and Its Application to the Vaporization of Bismuth Chloride 1,
J. Phys. Chem., 1966, 70, 7, 2410-2413, https://doi.org/10.1021/j100879a504
. [all data]
Darnell and Yosim, 1959
Darnell, A.J.; Yosim, S.J.,
Some Thermodynamic Properties of Solid Bismuth Chloride,
J. Phys. Chem., 1959, 63, 11, 1813-1815, https://doi.org/10.1021/j150581a005
. [all data]
Ozgen, 1983
Ozgen, T.,
Mass spectrometric determination of the appearance potentials of PCl3, AsCl3, SbCl3, BiCl3 and their fragments,
Int. J. Mass Spectrom. Ion Processes, 1983, 48, 427. [all data]
Novak and Potts, 1983
Novak, I.; Potts, A.W.,
The ultraviolet photoelectron spectra of gas phase and condensed bismuth halides and antimony trifluoride,
J. Chem. Soc. Dalton Trans., 1983, 635. [all data]