Barium fluoride
- Formula: BaF2
- Molecular weight: 175.324
- IUPAC Standard InChIKey: OYLGJCQECKOTOL-UHFFFAOYSA-L
- CAS Registry Number: 7787-32-8
- Chemical structure:
View 3d structure (requires JavaScript / HTML 5) - Permanent link for this species. Use this link for bookmarking this species for future reference.

Gas phase thermochemistry data

Quantity | Value | Units | Method | Reference | Comment |
---|---|---|---|---|---|
ΔfH°gas | -803.75 | kJ/mol | Review | Chase, 1998 | Data last reviewed in December, 1972 |
Quantity | Value | Units | Method | Reference | Comment |
S°gas,1 bar | 301.28 | J/mol*K | Review | Chase, 1998 | Data last reviewed in December, 1972 |
Gas Phase Heat Capacity (Shomate Equation)
Cp° = A + B*t + C*t2 + D*t3 +
E/t2
H° − H°298.15= A*t + B*t2/2 +
C*t3/3 + D*t4/4 − E/t + F − H
S° = A*ln(t) + B*t + C*t2/2 + D*t3/3 −
E/(2*t2) + G
Cp = heat capacity (J/mol*K)
H° = standard enthalpy (kJ/mol)
S° = standard entropy (J/mol*K)
t = temperature (K) / 1000.
View plot Requires a JavaScript / HTML 5 canvas capable browser.
Temperature (K) | 3500. to 6000. |
---|---|
A | 57.86890 |
B | 0.283943 |
C | -0.076997 |
D | 0.006573 |
E | -0.375534 |
F | -822.2732 |
G | 369.1213 |
H | -803.7464 |
Reference | Chase, 1998 |
Comment | Data last reviewed in December, 1972 |

Condensed phase thermochemistry data

Quantity | Value | Units | Method | Reference | Comment |
---|---|---|---|---|---|
ΔfH°liquid | -1171.29 | kJ/mol | Review | Chase, 1998 | Data last reviewed in December, 1972 |
Quantity | Value | Units | Method | Reference | Comment |
S°liquid,1 bar | 121.26 | J/mol*K | Review | Chase, 1998 | Data last reviewed in December, 1972 |
Quantity | Value | Units | Method | Reference | Comment |
ΔfH°solid | -1208.76 | kJ/mol | Review | Chase, 1998 | Data last reviewed in December, 1972 |
Quantity | Value | Units | Method | Reference | Comment |
S°solid | 96.39 | J/mol*K | Review | Chase, 1998 | Data last reviewed in December, 1972 |
Liquid Phase Heat Capacity (Shomate Equation)
Cp° = A + B*t + C*t2 + D*t3 +
E/t2
H° − H°298.15= A*t + B*t2/2 +
C*t3/3 + D*t4/4 − E/t + F − H
S° = A*ln(t) + B*t + C*t2/2 + D*t3/3 −
E/(2*t2) + G
Cp = heat capacity (J/mol*K)
H° = standard enthalpy (kJ/mol)
S° = standard entropy (J/mol*K)
t = temperature (K) / 1000.
View plot Requires a JavaScript / HTML 5 canvas capable browser.
Temperature (K) | 1641. to 3500. |
---|---|
A | 99.82606 |
B | -3.507435×10-8 |
C | 1.241606×10-8 |
D | -1.491688×10-9 |
E | -1.218633×10-8 |
F | -1213.699 |
G | 218.1412 |
H | -1171.294 |
Reference | Chase, 1998 |
Comment | Data last reviewed in December, 1972 |
Solid Phase Heat Capacity (Shomate Equation)
Cp° = A + B*t + C*t2 + D*t3 +
E/t2
H° − H°298.15= A*t + B*t2/2 +
C*t3/3 + D*t4/4 − E/t + F − H
S° = A*ln(t) + B*t + C*t2/2 + D*t3/3 −
E/(2*t2) + G
Cp = heat capacity (J/mol*K)
H° = standard enthalpy (kJ/mol)
S° = standard entropy (J/mol*K)
t = temperature (K) / 1000.
View plot Requires a JavaScript / HTML 5 canvas capable browser.
Temperature (K) | 298. to 900. | 900. to 1240. | 1240. to 1480. | 1480. to 1641. |
---|---|---|---|---|
A | 50.75200 | -297673.0 | 495029.0 | -351.8590 |
B | 114.0290 | 573416.0 | -709571.0 | 580.7820 |
C | -162.7770 | -412756.0 | 380866.0 | -275.0990 |
D | 92.21640 | 105325.0 | -72583.20 | 46.30240 |
E | -0.045675 | 31782.30 | -95735.10 | 114.8440 |
F | -1227.860 | 152849.0 | -345802.0 | -886.5710 |
G | 129.9720 | -386062.0 | 495789.0 | -201.9320 |
H | -1208.760 | -1208.760 | -1208.760 | -1208.760 |
Reference | Chase, 1998 | Chase, 1998 | Chase, 1998 | Chase, 1998 |
Comment | Data last reviewed in December, 1972 | Data last reviewed in December, 1972 | Data last reviewed in December, 1972 | Data last reviewed in December, 1972 |

Gas phase ion energetics data

Data compiled by: Henry M. Rosenstock, Keith Draxl, Bruce W. Steiner, and John T. Herron
Appearance energy determinations
Ion | AE (eV) | Other Products | Method | Reference | Comment |
---|---|---|---|---|---|
BaF+ | 13.5 ± 1.0 | F | EI | Hildenbrand, 1968 |

References

Chase, 1998
Chase, M.W., Jr.,
NIST-JANAF Themochemical Tables, Fourth Edition,
J. Phys. Chem. Ref. Data, Monograph 9, 1998, 1-1951. [all data]
Hildenbrand, 1968
Hildenbrand, D.L.,
Mass-spectrometric studies of bonding in the group IIA fluorides,
J. Chem. Phys., 1968, 48, 3657. [all data]