arsenic triiodide
- Formula: AsI3
- Molecular weight: 455.63501
- IUPAC Standard InChIKey: IKIBSPLDJGAHPX-UHFFFAOYSA-N
- CAS Registry Number: 7784-45-4
- Chemical structure:
View 3d structure (requires JavaScript / HTML 5) - Permanent link for this species. Use this link for bookmarking this species for future reference.

Phase change data

Antoine Equation Parameters
log10(P) = A − (B / (T + C))
P = vapor pressure (bar)
T = temperature (K)
View plot Requires a JavaScript / HTML 5 canvas capable browser.
Temperature (K) | A | B | C | Reference | Comment |
---|---|---|---|---|---|
437. to 602.7 | 4.42796 | 2551.888 | -63.616 | Cubicciotti and Eding, 1965 | Coefficents calculated by NIST from author's data. |

Gas phase ion energetics data

Data compiled by: Sharon G. Lias, Rhoda D. Levin, and Sherif A. Kafafi
Ionization energy determinations
IE (eV) | Method | Reference | Comment |
---|---|---|---|
9.0 ± 0.5 | EI | Alikhanyan, Steblevskii, et al., 1980 | |
9.00 ± 0.04 | PE | Peel and Willett, 1976 | Vertical value |
9.11 | PE | Lee and Rabalais, 1974 | Vertical value |
Appearance energy determinations
Ion | AE (eV) | Other Products | Method | Reference | Comment |
---|---|---|---|---|---|
AsI+ | 10.5 ± 0.5 | 2I/I2 | EI | Alikhanyan, Steblevskii, et al., 1980 | |
AsI2+ | 9.5 ± 0.5 | I | EI | Alikhanyan, Steblevskii, et al., 1980 | |
I2+ | 13.6 ± 1.0 | AsI | EI | Alikhanyan, Steblevskii, et al., 1980 |

Vibrational and/or electronic energy levels

Data compiled by: Takehiko Shimanouchi
Symmetry: C3ν Symmetry Number σ = 3
Sym. | No | Approximate | Selected Freq. | Infrared | Raman | Comments | ||||
---|---|---|---|---|---|---|---|---|---|---|
Species | type of mode | Value | Rating | Value | Phase | Value | Phase | |||
a1 | 1 | Sym str | 219 | C | 225.7 | sln. | 218.5 p | solid solid | ||
a1 | 2 | Sym deform | 94 | C | 101.6 | sln. | 94 p | solid solid | ||
e | 3 | Deg str | 224 | C | 201.2 b | sln. | 223.5 dp | solid solid | ||
e | 4 | Deg deform | 71 | C | 73.6 | sln. | 71 dp | solid solid | ||
Source: Shimanouchi, 1972

References

Cubicciotti and Eding, 1965
Cubicciotti, D.; Eding, H.,
The Vapor Pressure and Enthalpy of Arsenic Triiodide and its Absolute Entropy at 298 K,
J. Phys. Chem., 1965, 69, 8, 2743-2746, https://doi.org/10.1021/j100892a043
. [all data]
Alikhanyan, Steblevskii, et al., 1980
Alikhanyan, A.S.; Steblevskii, A.V.; Lazarev, V.B.; Kalinnikov, V.T.; Grinberg, Y.K.; Zhukov, E.G.; Agamirova, L.M.; Gorgoraki, V.I.,
Thermodynamic properties of gaseous arsenic iodides,
Izv. Akad. Nauk SSSR, Neorg. Mater., 1980, 16, 73. [all data]
Peel and Willett, 1976
Peel, J.B.; Willett, G.D.,
The photoelectron spectra of arsenic tribromide and arsenic triiodide,
J. Electron Spectrosc. Relat. Phenom., 1976, 9, 175. [all data]
Lee and Rabalais, 1974
Lee, T.H.; Rabalais, J.W.,
Model for spin- orbit interactions with inclusion of d electrons: Applications to photoelectron spectroscopy,
J. Chem. Phys., 1974, 60, 1172. [all data]
Shimanouchi, 1972
Shimanouchi, T.,
Tables of Molecular Vibrational Frequencies Consolidated Volume II,
J. Phys. Chem. Ref. Data, 1972, 6, 3, 993-1102. [all data]