pentafluoroarsorane
- Formula: AsF5
- Molecular weight: 169.91362
- IUPAC Standard InChIKey: YBGKQGSCGDNZIB-UHFFFAOYSA-N
- CAS Registry Number: 7784-36-3
- Chemical structure:
View 3d structure (requires JavaScript / HTML 5) - Other names: Arsenic pentafluoride

Phase change data

Antoine Equation Parameters
log10(P) = A − (B / (T + C))
P = vapor pressure (bar)
T = temperature (K)
View plot Requires a JavaScript / HTML 5 canvas capable browser.
Temperature (K) | A | B | C | Reference | Comment |
---|---|---|---|---|---|
155.3 to 220.4 | 2.88349 | 369.088 | -91.799 | Stull, 1947 | Coefficents calculated by NIST from author's data. |

Gas phase ion energetics data

Data compiled as indicated in comments:
LBLHLM - Sharon G. Lias, John E. Bartmess, Joel F. Liebman, John L. Holmes, Rhoda D. Levin, and W. Gary Mallard
LLK - Sharon G. Lias, Rhoda D. Levin, and Sherif A. Kafafi
Ionization energy determinations
IE (eV) | Method | Reference | Comment |
---|---|---|---|
15.0 | PE | Runger, 1985 | LBLHLM |
15.53 | PE | Runger, 1985 | Vertical value; LBLHLM |
Appearance energy determinations
Ion | AE (eV) | Other Products | Method | Reference | Comment |
---|---|---|---|---|---|
AsF+ | 23.8 ± 0.2 | ? | EI | Pabst, Sharpe, et al., 1980 | LLK |
AsF2+ | 15.8 ± 0.2 | ? | EI | Pabst, Sharpe, et al., 1980 | LLK |
AsF3+ | 14.0 ± 0.1 | F2(-) | EI | Pabst, Sharpe, et al., 1980 | LLK |
AsF4+ | 13.8 ± 0.2 | F(-) | EI | Pabst, Sharpe, et al., 1980 | LLK |
F+ | 22.1 ± 0.2 | AsF4 | EI | Pabst, Sharpe, et al., 1980 | LLK |

Reaction thermochemistry data

Data compiled by: John E. Bartmess
Individual Reactions
By formula: F- + AsF5 = (F- • AsF5)
Quantity | Value | Units | Method | Reference | Comment |
---|---|---|---|---|---|
ΔrH° | >85. ± 10. | kcal/mol | N/A | Haartz and McDaniel, 1973 | gas phase; Greater than BCl3 |
Quantity | Value | Units | Method | Reference | Comment |
ΔrG° | >74. ± 10. | kcal/mol | IMRB | Haartz and McDaniel, 1973 | gas phase; Greater than BCl3 |

Ion clustering data

Data compiled by: John E. Bartmess
Clustering reactions
By formula: F- + AsF5 = (F- • AsF5)
Quantity | Value | Units | Method | Reference | Comment |
---|---|---|---|---|---|
ΔrH° | >85. ± 10. | kcal/mol | N/A | Haartz and McDaniel, 1973 | gas phase; Greater than BCl3 |
Quantity | Value | Units | Method | Reference | Comment |
ΔrG° | >74. ± 10. | kcal/mol | IMRB | Haartz and McDaniel, 1973 | gas phase; Greater than BCl3 |

Vibrational and/or electronic energy levels

Data compiled by: Takehiko Shimanouchi

Symmetry:   D3h     Symmetry Number σ = 6

 Sym.   No   Approximate   Selected Freq.  Infrared   Raman   Comments
 Species   type of mode   Value   Rating   Value  Phase  Value  Phase

a1' 1 AsF3 s-str 734  C 734.3 VS p gas
a1' 2 AsF2 s-str 644  C 644 M gas
a2 3 AsF2 a-str 787  B 787.4 VS gas
a2 4 AsF3 op-deform 400  B 400.4 S gas
e' 5 AsF3 d-str 811  B 811.4 VS gas 813 M dp gas
e' 6 AsF3 d-deform 372  C 372 S gas 366 liq.
e' 7 AsF bend 123  C 123 W gas 130 M dp gas
e 8 AsF bend 386  C 386 M dp gas

Source: Shimanouchi, 1972

References

Stull, 1947
Stull, Daniel R.,
Vapor Pressure of Pure Substances. Organic and Inorganic Compounds,
Ind. Eng. Chem., 1947, 39, 4, 517-540, https://doi.org/10.1021/ie50448a022
. [all data]
Runger, 1985
Runger, G.,
Title unavailable, Ph.D. Thesis for Univ. of Hamburg, 1985. [all data]
Pabst, Sharpe, et al., 1980
Pabst, R.E.; Sharpe, M.C.; Margrave, J.L.; Franklin, J.L.,
An electron impact study of the appearance energies of positive ions from AsF3, AsCl3, AsBr3 and AsF5,
Int. J. Mass Spectrom. Ion Phys., 1980, 33, 187. [all data]