Arsenic trichloride
- Formula: AsCl3
- Molecular weight: 181.281
- IUPAC Standard InChIKey: OEYOHULQRFXULB-UHFFFAOYSA-N
- CAS Registry Number: 7784-34-1
- Chemical structure:

Reaction thermochemistry data

Data compiled by: John E. Bartmess
Individual Reactions
+
= AsCl4-
By formula: Cl- + AsCl3 = AsCl4-
Quantity | Value | Units | Method | Reference | Comment |
---|---|---|---|---|---|
ΔrH° | 115. ± 7.1 | kJ/mol | CIDT | Walker, Check, et al., 2002 | gas phase |

Gas phase ion energetics data

Data compiled as indicated in comments:
LBLHLM - Sharon G. Lias, John E. Bartmess, Joel F. Liebman, John L. Holmes, Rhoda D. Levin, and W. Gary Mallard
LLK - Sharon G. Lias, Rhoda D. Levin, and Sherif A. Kafafi
RDSH - Henry M. Rosenstock, Keith Draxl, Bruce W. Steiner, and John T. Herron
Ionization energy determinations
IE (eV) | Method | Reference | Comment |
---|---|---|---|
11.2 ± 0.1 | EI | Ozgen, 1983 | LBLHLM |
11.6 ± 0.05 | EI | Pabst, Sharpe, et al., 1980 | LLK |
10.57 ± 0.03 | EI | Johnstone and Mellon, 1972 | LLK |
10.55 ± 0.025 | PE | Johnstone and Mellon, 1972 | LLK |
10.72 ± 0.07 | PE | Lloyd, 1970 | RDSH |
11.7 ± 0.1 | EI | Cullen and Frost, 1962 | RDSH |
10.90 | PE | Lee and Rabalais, 1974 | Vertical value; LLK |
Appearance energy determinations
Ion | AE (eV) | Other Products | Method | Reference | Comment |
---|---|---|---|---|---|
As+ | 17.4 ± 0.1 | ? | EI | Ozgen, 1983 | LBLHLM |
As+ | 20.4 ± 0.4 | 3Cl | EI | Pabst, Sharpe, et al., 1980 | LLK |
AsCl+ | 16.6 ± 0.1 | Cl2/2Cl | EI | Ozgen, 1983 | LBLHLM |
ClAs+ | 17.7 ± 0.2 | ? | EI | Pabst, Sharpe, et al., 1980 | LLK |
AsCl2+ | 12.1 ± 0.1 | Cl | EI | Ozgen, 1983 | LBLHLM |
Cl2As+ | 12.4 ± 0.2 | Cl- | EI | Pabst, Sharpe, et al., 1980 | LLK |
Cl+ | 22.0 ± 0.1 | ? | EI | Ozgen, 1983 | LBLHLM |

Ion clustering data

Data compiled by: John E. Bartmess
Clustering reactions
+
= AsCl4-
By formula: Cl- + AsCl3 = AsCl4-
Quantity | Value | Units | Method | Reference | Comment |
---|---|---|---|---|---|
ΔrH° | 115. ± 7.1 | kJ/mol | CIDT | Walker, Check, et al., 2002 | gas phase |

Phase change data

Data compiled as indicated in comments:
TRC - Thermodynamics Research Center, NIST Boulder Laboratories, Chris Muzny director

Quantity Value Units Method Reference Comment
Tc653.KN/ASladkov and Shimeleva, 1974Uncertainty assigned by TRC = 2. K; TRC
Quantity Value Units Method Reference Comment
Vc0.247l/molN/ASladkov and Shimeleva, 1974Uncertainty assigned by TRC = 0.005 l/mol; Abstract, no details; TRC

Antoine Equation Parameters

log10(P) = A − (B / (T + C))
    P = vapor pressure (atm)
    T = temperature (K)

View plot Requires a JavaScript / HTML 5 canvas capable browser.

Temperature (K) A B C Reference Comment
261.8 - 403.64.469761620.019-41.362Stull, 1947Coefficents calculated by NIST from author's data.

In addition to the Thermodynamics Research Center (TRC) data available from this site, much more physical and chemical property data is available from the following TRC products:

References

Walker, Check, et al., 2002
Walker, B.W.; Check, C.E.; Lobring, K.C.; Pommerening, C.A.; Sunderlin, L.S.,
The Thermochemistry of Group 15 Tetrachloride Anions,
J. Am. Soc. Mass Spectrom., 2002, 13, 5, 469, https://doi.org/10.1016/S1044-0305(02)00369-0
. [all data]
Ozgen, 1983
Ozgen, T.,
Mass spectrometric determination of the appearance potentials of PCl3, AsCl3, SbCl3, BiCl3 and their fragments,
Int. J. Mass Spectrom. Ion Processes, 1983, 48, 427. [all data]
Pabst, Sharpe, et al., 1980
Pabst, R.E.; Sharpe, M.C.; Margrave, J.L.; Franklin, J.L.,
An electron impact study of the appearance energies of positive ions from AsF3, AsCl3, AsBr3 and AsF5,
Int. J. Mass Spectrom. Ion Phys., 1980, 33, 187. [all data]
Johnstone and Mellon, 1972
Johnstone, R.A.W.; Mellon, F.A.,
Electron-impact ionization and appearance potentials,
J. Chem. Soc. Faraday Trans. 2, 1972, 68, 1209. [all data]
Lloyd, 1970
Lloyd, D.R.,
The failure of electron impact measurements to detect first ionization potentials in some molecules,
Intern. J. Mass Spectrom. Ion Phys., 1970, 4, 500. [all data]
Cullen and Frost, 1962
Cullen, W.R.; Frost, D.C.,
Ionization potentials of some perfluoroalkyl arsines,
Can. J. Chem., 1962, 40, 390. [all data]
Lee and Rabalais, 1974
Lee, T.H.; Rabalais, J.W.,
Model for spin- orbit interactions with inclusion of d electrons: Applications to photoelectron spectroscopy,
J. Chem. Phys., 1974, 60, 1172. [all data]