arsenic tribromide
- Formula: AsBr3
- Molecular weight: 314.634
- IUPAC Standard InChIKey: JMBNQWNFNACVCB-UHFFFAOYSA-N
- CAS Registry Number: 7784-33-0
- Chemical structure:
View 3d structure (requires JavaScript / HTML 5) - Permanent link for this species. Use this link for bookmarking this species for future reference.

Phase change data

Data compiled as indicated in comments:
TRC - Thermodynamics Research Center, NIST Boulder Laboratories, Chris Muzny director
Quantity | Value | Units | Method | Reference | Comment |
---|---|---|---|---|---|
Tfus | 577.20 | K | N/A | Maheshwari, Suri, et al., 1979 | Uncertainty assigned by TRC = 0.2 K; TRC |
Antoine Equation Parameters
log10(P) = A − (B / (T + C))
P = vapor pressure (bar)
T = temperature (K)
View plot Requires a JavaScript / HTML 5 canvas capable browser.
Temperature (K) | A | B | C | Reference | Comment |
---|---|---|---|---|---|
314.9 to 493. | 4.44984 | 2016.313 | -39.606 | Stull, 1947 | Coefficents calculated by NIST from author's data. |

Gas phase ion energetics data

Data compiled by: Sharon G. Lias, Rhoda D. Levin, and Sherif A. Kafafi
Ionization energy determinations
IE (eV) | Method | Reference | Comment |
---|---|---|---|
8.7 ± 0.05 | EI | Pabst, Sharpe, et al., 1980 | |
10.21 ± 0.04 | PE | Peel and Willett, 1976 | Vertical value |
10.19 | PE | Lee and Rabalais, 1974 | Vertical value |
Appearance energy determinations
Ion | AE (eV) | Other Products | Method | Reference | Comment |
---|---|---|---|---|---|
AsBr+ | 12.5 ± 0.2 | ? | EI | Pabst, Sharpe, et al., 1980 | |
AsBr2+ | 8.4 ± 0.2 | Br(-) | EI | Pabst, Sharpe, et al., 1980 | |
Br+ | 15.0 ± 0.2 | AsBr2 | EI | Pabst, Sharpe, et al., 1980 | |
Br2+ | 13.4 ± 0.1 | AsBr | EI | Pabst, Sharpe, et al., 1980 |

References

Maheshwari, Suri, et al., 1979
Maheshwari, R.C.; Suri, S.K.; Tewari, U.S.,
Excess Volumes of Mixing of Binary Mixtures or Arsenic Tribromide with Benzene, Cyclohexane, and Carbon Tetrachloride at 202.15, 308.15 and 313.15,
J. Chem. Eng. Data, 1979, 24, 237. [all data]
Stull, 1947
Stull, Daniel R.,
Vapor Pressure of Pure Substances. Organic and Inorganic Compounds,
Ind. Eng. Chem., 1947, 39, 4, 517-540, https://doi.org/10.1021/ie50448a022
. [all data]
Pabst, Sharpe, et al., 1980
Pabst, R.E.; Sharpe, M.C.; Margrave, J.L.; Franklin, J.L.,
An electron impact study of the appearance energies of positive ions from AsF3, AsCl3, AsBr3 and AsF5,
Int. J. Mass Spectrom. Ion Phys., 1980, 33, 187. [all data]
Peel and Willett, 1976
Peel, J.B.; Willett, G.D.,
The photoelectron spectra of arsenic tribromide and arsenic triiodide,
J. Electron Spectrosc. Relat. Phenom., 1976, 9, 175. [all data]
Lee and Rabalais, 1974
Lee, T.H.; Rabalais, J.W.,
Model for spin- orbit interactions with inclusion of d electrons: Applications to photoelectron spectroscopy,
J. Chem. Phys., 1974, 60, 1172. [all data]