aluminium iodide
- Formula: AlI3
- Molecular weight: 407.69495
- CAS Registry Number: 7784-23-8

Gas phase thermochemistry data

Quantity | Value | Units | Method | Reference | Comment |
---|---|---|---|---|---|
ΔfH°gas | -193.30 | kJ/mol | Review | Chase, 1998 | Data last reviewed in September, 1979 |
Quantity | Value | Units | Method | Reference | Comment |
S°gas,1 bar | 373.60 | J/mol*K | Review | Chase, 1998 | Data last reviewed in September, 1979 |
Gas Phase Heat Capacity (Shomate Equation)
Cp° = A + B*t + C*t2 + D*t3 +
E/t2
H° − H°298.15= A*t + B*t2/2 +
C*t3/3 + D*t4/4 − E/t + F − H
S° = A*ln(t) + B*t + C*t2/2 + D*t3/3 −
E/(2*t2) + G
Cp = heat capacity (J/mol*K)
H° = standard enthalpy (kJ/mol)
S° = standard entropy (J/mol*K)
t = temperature (K) / 1000.
View plot Requires a JavaScript / HTML 5 canvas capable browser.
Temperature (K) | 2000. to 6000. |
---|---|
A | 82.63693 |
B | 0.433078 |
C | -0.117411 |
D | 0.010023 |
E | -0.512210 |
F | -219.6755 |
G | 470.5954 |
H | -193.3012 |
Reference | Chase, 1998 |
Comment | Data last reviewed in September, 1979 |

Condensed phase thermochemistry data

Quantity | Value | Units | Method | Reference | Comment |
---|---|---|---|---|---|
ΔfH°liquid | -289.44 | kJ/mol | Review | Chase, 1998 | Data last reviewed in September, 1979 |
Quantity | Value | Units | Method | Reference | Comment |
S°liquid,1 bar | 223.65 | J/mol*K | Review | Chase, 1998 | Data last reviewed in September, 1979 |
Quantity | Value | Units | Method | Reference | Comment |
ΔfH°solid | -302.92 | kJ/mol | Review | Chase, 1998 | Data last reviewed in September, 1979 |
Quantity | Value | Units | Method | Reference | Comment |
S°solid | 195.95 | J/mol*K | Review | Chase, 1998 | Data last reviewed in September, 1979 |
Liquid Phase Heat Capacity (Shomate Equation)
Cp° = A + B*t + C*t2 + D*t3 +
E/t2
H° − H°298.15= A*t + B*t2/2 +
C*t3/3 + D*t4/4 − E/t + F − H
S° = A*ln(t) + B*t + C*t2/2 + D*t3/3 −
E/(2*t2) + G
Cp = heat capacity (J/mol*K)
H° = standard enthalpy (kJ/mol)
S° = standard entropy (J/mol*K)
t = temperature (K) / 1000.
View plot Requires a JavaScript / HTML 5 canvas capable browser.
Temperature (K) | 464.15 to 2000. |
---|---|
A | 121.3360 |
B | 3.125110×10-9 |
C | -2.529338×10-9 |
D | 6.469050×10-10 |
E | 4.841768×10-11 |
F | -325.6202 |
G | 370.4848 |
H | -289.4441 |
Reference | Chase, 1998 |
Comment | Data last reviewed in September, 1979 |
Solid Phase Heat Capacity (Shomate Equation)
Cp° = A + B*t + C*t2 + D*t3 +
E/t2
H° − H°298.15= A*t + B*t2/2 +
C*t3/3 + D*t4/4 − E/t + F − H
S° = A*ln(t) + B*t + C*t2/2 + D*t3/3 −
E/(2*t2) + G
Cp = heat capacity (J/mol*K)
H° = standard enthalpy (kJ/mol)
S° = standard entropy (J/mol*K)
t = temperature (K) / 1000.
View plot Requires a JavaScript / HTML 5 canvas capable browser.
Temperature (K) | 298. to 464.15 |
---|---|
A | 72.27609 |
B | 148.9789 |
C | -128.2329 |
D | 36.47553 |
E | -0.667737 |
F | -332.3213 |
G | 240.6160 |
H | -302.9224 |
Reference | Chase, 1998 |
Comment | Data last reviewed in September, 1979 |

Gas phase ion energetics data

Data compiled by: Sharon G. Lias, Rhoda D. Levin, and Sherif A. Kafafi
Ionization energy determinations
IE (eV) | Method | Reference | Comment |
---|---|---|---|
9.1 | PE | Barker, Lappert, et al., 1975 | |
9.66 | PE | Barker, Lappert, et al., 1975 | Vertical value |
9.66 | PE | Lappert, Pedley, et al., 1974 | Vertical value |

References

Chase, 1998
Chase, M.W., Jr.,
NIST-JANAF Themochemical Tables, Fourth Edition,
J. Phys. Chem. Ref. Data, Monograph 9, 1998, 1-1951. [all data]
Barker, Lappert, et al., 1975
Barker, G.K.; Lappert, M.F.; Pedley, J.B.; Sharp, G.J.; Westwood, N.P.C.,
Bonding studies of boron and the group 3-5 elements. Part XV. He(I) photoelectron spectra of monomeric group 3 tri-halide, trimethyl, and mixed halogenomethyl species,
J. Chem. Soc. Dalton Trans., 1975, 1765. [all data]
Lappert, Pedley, et al., 1974
Lappert, M.F.; Pedley, J.B.; Sharp, G.J.; Westwood, N.P.C.,
Bonding studies of compounds of boron and the Group III and IV elements. XII. Variable temperature HeI photoelectron spectra of Group III halides, 2MX3<=>M2X6(M=Al or Ga, X=Cl, Br, or I),
J. Electron Spectrosc. Relat. Phenom., 1974, 3, 237. [all data]