Aluminum fluoride
- Formula: AlF3
- Molecular weight: 83.9767482
- IUPAC Standard InChIKey: KLZUFWVZNOTSEM-UHFFFAOYSA-K
- CAS Registry Number: 7784-18-1
- Chemical structure:
View 3d structure (requires JavaScript / HTML 5) - Other names: aluminium fluoride; Aluminum trifluoride

Gas phase thermochemistry data

Quantity | Value | Units | Method | Reference | Comment |
---|---|---|---|---|---|
ΔfH°gas | -1209.32 | kJ/mol | Review | Chase, 1998 | Data last reviewed in September, 1979 |
Quantity | Value | Units | Method | Reference | Comment |
S°gas,1 bar | 276.67 | J/mol*K | Review | Chase, 1998 | Data last reviewed in September, 1979 |
Gas Phase Heat Capacity (Shomate Equation)
Cp° = A + B*t + C*t2 + D*t3 +
E/t2
H° − H°298.15= A*t + B*t2/2 +
C*t3/3 + D*t4/4 − E/t + F − H
S° = A*ln(t) + B*t + C*t2/2 + D*t3/3 −
E/(2*t2) + G
Cp = heat capacity (J/mol*K)
H° = standard enthalpy (kJ/mol)
S° = standard entropy (J/mol*K)
t = temperature (K) / 1000.
View plot Requires a JavaScript / HTML 5 canvas capable browser.
Temperature (K) | 4000. to 6000. |
---|---|
A | 83.06746 |
B | 0.033893 |
C | -0.005659 |
D | 0.000335 |
E | -3.326694 |
F | -1243.401 |
G | 363.1469 |
H | -1209.322 |
Reference | Chase, 1998 |
Comment | Data last reviewed in September, 1979 |

Condensed phase thermochemistry data

Quantity | Value | Units | Method | Reference | Comment |
---|---|---|---|---|---|
ΔfH°liquid | -1422.76 | kJ/mol | Review | Chase, 1998 | Data last reviewed in September, 1979 |
Quantity | Value | Units | Method | Reference | Comment |
S°liquid,1 bar | 95.38 | J/mol*K | Review | Chase, 1998 | Data last reviewed in September, 1979 |
Quantity | Value | Units | Method | Reference | Comment |
ΔfH°solid | -1510.4 ± 1.3 | kJ/mol | Review | Cox, Wagman, et al., 1984 | CODATA Review value |
ΔfH°solid | -1510.42 | kJ/mol | Review | Chase, 1998 | Data last reviewed in September, 1979 |
Quantity | Value | Units | Method | Reference | Comment |
S°solid,1 bar | 66.5 ± 0.5 | J/mol*K | Review | Cox, Wagman, et al., 1984 | CODATA Review value |
Quantity | Value | Units | Method | Reference | Comment |
S°solid | 66.48 | J/mol*K | Review | Chase, 1998 | Data last reviewed in September, 1979 |
Liquid Phase Heat Capacity (Shomate Equation)
Cp° = A + B*t + C*t2 + D*t3 +
E/t2
H° − H°298.15= A*t + B*t2/2 +
C*t3/3 + D*t4/4 − E/t + F − H
S° = A*ln(t) + B*t + C*t2/2 + D*t3/3 −
E/(2*t2) + G
Cp = heat capacity (J/mol*K)
H° = standard enthalpy (kJ/mol)
S° = standard entropy (J/mol*K)
t = temperature (K) / 1000.
View plot Requires a JavaScript / HTML 5 canvas capable browser.
Temperature (K) | 2523. to 4000. |
---|---|
A | 125.5200 |
B | -0.000003 |
C | 7.016442×10-7 |
D | -6.490724×10-8 |
E | -0.000003 |
F | -1496.487 |
G | 201.5002 |
H | -1422.761 |
Reference | Chase, 1998 |
Comment | Data last reviewed in September, 1979 |
Solid Phase Heat Capacity (Shomate Equation)
Cp° = A + B*t + C*t2 + D*t3 +
E/t2
H° − H°298.15= A*t + B*t2/2 +
C*t3/3 + D*t4/4 − E/t + F − H
S° = A*ln(t) + B*t + C*t2/2 + D*t3/3 −
E/(2*t2) + G
Cp = heat capacity (J/mol*K)
H° = standard enthalpy (kJ/mol)
S° = standard entropy (J/mol*K)
t = temperature (K) / 1000.
View plot Requires a JavaScript / HTML 5 canvas capable browser.
Temperature (K) | 298. to 728. | 728. to 2523. |
---|---|---|
A | -27.17362 | 92.96722 |
B | 594.2661 | 8.667826 |
C | -1042.272 | 0.148503 |
D | 662.4444 | -0.006692 |
E | 0.019262 | -0.942781 |
F | -1520.775 | -1541.369 |
G | -103.0051 | 170.2754 |
H | -1510.424 | -1510.424 |
Reference | Chase, 1998 | Chase, 1998 |
Comment | Data last reviewed in September, 1979 | Data last reviewed in September, 1979 |

Phase change data

Antoine Equation Parameters
log10(P) = A − (B / (T + C))
P = vapor pressure (bar)
T = temperature (K)
View plot Requires a JavaScript / HTML 5 canvas capable browser.
Temperature (K) | A | B | C | Reference | Comment |
---|---|---|---|---|---|
1511. to 1810. | 7.13005 | 7298.239 | -784.204 | Stull, 1947 | Coefficents calculated by NIST from author's data. |

Reaction thermochemistry data

Data compiled as indicated in comments:
B - John E. Bartmess
M - Michael M. Meot-Ner (Mautner) and Sharon G. Lias
Individual Reactions
By formula: F- + AlF3 = (F- • AlF3)
Quantity | Value | Units | Method | Reference | Comment |
---|---|---|---|---|---|
ΔrH° | 510. ± 90. | kJ/mol | AVG | N/A | Average of 7 values; Individual data points |
By formula: AlF4- + AlF3 = (AlF4- • AlF3)
Quantity | Value | Units | Method | Reference | Comment |
---|---|---|---|---|---|
ΔrH° | 204. ± 4.2 | kJ/mol | TDAs | Sidorov, Nikitin, et al., 1980 | gas phase; value altered from reference due to conversion from electron convention to ion convention; B |
Quantity | Value | Units | Method | Reference | Comment |
ΔrG° | 175. ± 8.4 | kJ/mol | TDAs | Sidorov, Nikitin, et al., 1980 | gas phase; value altered from reference due to conversion from electron convention to ion convention; B |
By formula: Cl- + AlF3 = (Cl- • AlF3)
Quantity | Value | Units | Method | Reference | Comment |
---|---|---|---|---|---|
ΔrH° | 311. ± 12. | kJ/mol | TDAs | Pervova, Korobov, et al., 1992 | gas phase; Thermo at 0K, experiment at 800-1100 K. See also AlClF2..F-; value altered from reference due to conversion from electron convention to ion convention; B |
By formula: (F- • AlF3) + AlF3 = (F- • 2AlF3)
Quantity | Value | Units | Method | Reference | Comment |
---|---|---|---|---|---|
ΔrH° | 230. | kJ/mol | MS | Pyatenko, Gusarov, et al., 1981 | gas phase; Knudsen cell; M |
ΔrH° | 204. | kJ/mol | MS | Nikitin, Skokan, et al., 1979 | gas phase; Knudsen cell; M |

Gas phase ion energetics data

Data compiled as indicated in comments:
LBLHLM - Sharon G. Lias, John E. Bartmess, Joel F. Liebman, John L. Holmes, Rhoda D. Levin, and W. Gary Mallard
RDSH - Henry M. Rosenstock, Keith Draxl, Bruce W. Steiner, and John T. Herron
Ionization energy determinations
IE (eV) | Method | Reference | Comment |
---|---|---|---|
15.45 ± 0.02 | PE | Dyke, Kirby, et al., 1984 | Vertical value; LBLHLM |
Appearance energy determinations
Ion | AE (eV) | Other Products | Method | Reference | Comment |
---|---|---|---|---|---|
AlF2+ | 15.5 ± 1.0 | F | EI | Hildenbrand, 1968 | RDSH |
AlF2+ | 15.2 ± 0.3 | F | EI | Ehlert, Blue, et al., 1964 | RDSH |

Ion clustering data

Data compiled as indicated in comments:
B - John E. Bartmess
M - Michael M. Meot-Ner (Mautner) and Sharon G. Lias
Clustering reactions
By formula: AlF4- + AlF3 = (AlF4- • AlF3)
Quantity | Value | Units | Method | Reference | Comment |
---|---|---|---|---|---|
ΔrH° | 204. ± 4.2 | kJ/mol | TDAs | Sidorov, Nikitin, et al., 1980 | gas phase; value altered from reference due to conversion from electron convention to ion convention; B |
Quantity | Value | Units | Method | Reference | Comment |
ΔrG° | 175. ± 8.4 | kJ/mol | TDAs | Sidorov, Nikitin, et al., 1980 | gas phase; value altered from reference due to conversion from electron convention to ion convention; B |
By formula: Cl- + AlF3 = (Cl- • AlF3)
Quantity | Value | Units | Method | Reference | Comment |
---|---|---|---|---|---|
ΔrH° | 311. ± 12. | kJ/mol | TDAs | Pervova, Korobov, et al., 1992 | gas phase; Thermo at 0K, experiment at 800-1100 K. See also AlClF2..F-; value altered from reference due to conversion from electron convention to ion convention; B |
By formula: F- + AlF3 = (F- • AlF3)
Quantity | Value | Units | Method | Reference | Comment |
---|---|---|---|---|---|
ΔrH° | 510. ± 90. | kJ/mol | AVG | N/A | Average of 7 values; Individual data points |
By formula: (F- • AlF3) + AlF3 = (F- • 2AlF3)
Quantity | Value | Units | Method | Reference | Comment |
---|---|---|---|---|---|
ΔrH° | 230. | kJ/mol | MS | Pyatenko, Gusarov, et al., 1981 | gas phase; Knudsen cell; M |
ΔrH° | 204. | kJ/mol | MS | Nikitin, Skokan, et al., 1979 | gas phase; Knudsen cell; M |

References

Chase, 1998
Chase, M.W., Jr.,
NIST-JANAF Themochemical Tables, Fourth Edition,
J. Phys. Chem. Ref. Data, Monograph 9, 1998, 1-1951. [all data]
Cox, Wagman, et al., 1984
Cox, J.D.; Wagman, D.D.; Medvedev, V.A.,
CODATA Key Values for Thermodynamics, Hemisphere Publishing Corp., New York, 1984, 1. [all data]
Stull, 1947
Stull, Daniel R.,
Vapor Pressure of Pure Substances. Organic and Inorganic Compounds,
Ind. Eng. Chem., 1947, 39, 4, 517-540, https://doi.org/10.1021/ie50448a022
. [all data]
Sidorov, Nikitin, et al., 1980
Sidorov, L.N.; Nikitin, M.I.; Skokan, E.V.; Sorokin, I.D.,
Mass-spectrometric determination of enthalpies of dissociation of gaseous complex fluorides into neutral and charged particles. II. Heats of formation of AlF4- and KF2-,
Int. J. Mass Spectrom. Ion Phys., 1980, 35, 203. [all data]
Pervova, Korobov, et al., 1992
Pervova, Y.U.; Korobov, M.V.; Sidorov, L.N.,
Enthalpies of Bonds Rupture in AlClnF4-n(-) Anions,
Russ. J. Phys. Chem., 1992, 66, 635. [all data]
Pyatenko, Gusarov, et al., 1981
Pyatenko, A.T.; Gusarov, A.V.; Gorokhov, L.N.,
Negative Ions in the Vapor Over Lanthanum Trifluoride,
High Temp., 1981, 19, 241. [all data]
Nikitin, Skokan, et al., 1979
Nikitin, M.I.; Skokan, E.V.; Sorokin, I.D.; Sidorov, L.N.,
Sov. Phys. Dokl., 1979, 247, 594. [all data]
Dyke, Kirby, et al., 1984
Dyke, J.M.; Kirby, C.; Morris, A.; Gravenor, B.W.J.; Klein, R.; Rosmus, P.,
A study of aluminium monofluoride and aluminium trifluoride by high-temperature photoelectron spectroscopy,
Chem. Phys., 1984, 88, 289. [all data]
Hildenbrand, 1968
Hildenbrand, D.L.,
Mass-spectrometric studies of bonding in the group IIA fluorides,
J. Chem. Phys., 1968, 48, 3657. [all data]
Ehlert, Blue, et al., 1964
Ehlert, T.C.; Blue, G.D.; Green, J.W.; Margrave, J.L.,
Mass spectrometric studies at high temperatures. IV. Dissociation energies of the alkaline earth monofluorides,
J. Chem. Phys., 1964, 41, 2250. [all data]