aluminium sodium tetrachloride
- Formula: AlCl4Na
- Molecular weight: 191.783
- CAS Registry Number: 7784-16-9

Condensed phase thermochemistry data

Quantity | Value | Units | Method | Reference | Comment |
---|---|---|---|---|---|
ΔfH°solid | -1142.23 | kJ/mol | Review | Chase, 1998 | Data last reviewed in June, 1963 |
Quantity | Value | Units | Method | Reference | Comment |
S°solid | 188.30 | J/mol*K | Review | Chase, 1998 | Data last reviewed in June, 1963 |
Solid Phase Heat Capacity (Shomate Equation)
Cp° = A + B*t + C*t2 + D*t3 +
E/t2
H° − H°298.15= A*t + B*t2/2 +
C*t3/3 + D*t4/4 − E/t + F − H
S° = A*ln(t) + B*t + C*t2/2 + D*t3/3 −
E/(2*t2) + G
Cp = heat capacity (J/mol*K)
H° = standard enthalpy (kJ/mol)
S° = standard entropy (J/mol*K)
t = temperature (K) / 1000.
View plot Requires a JavaScript / HTML 5 canvas capable browser.
Temperature (K) | 298. to 1000. |
---|---|
A | 86.29207 |
B | 243.2272 |
C | -166.2332 |
D | 35.01397 |
E | 0.876477 |
F | -1174.424 |
G | 232.2179 |
H | -1142.232 |
Reference | Chase, 1998 |
Comment | Data last reviewed in June, 1963 |

Gas phase ion energetics data

Data compiled by: Sharon G. Lias, John E. Bartmess, Joel F. Liebman, John L. Holmes, Rhoda D. Levin, and W. Gary Mallard
Appearance energy determinations
Ion | AE (eV) | Other Products | Method | Reference | Comment |
---|---|---|---|---|---|
AlCl2+ | 13.9 ± 0.5 | ? | EI | Wahlbeck, 1987 |

References

Chase, 1998
Chase, M.W., Jr.,
NIST-JANAF Themochemical Tables, Fourth Edition,
J. Phys. Chem. Ref. Data, Monograph 9, 1998, 1-1951. [all data]
Wahlbeck, 1987
Wahlbeck, P.G.,
Mass spectrometry of and standard enthalpies of formation of gaseous sodium tetrachloroaluminate and its dimer,
J. Chem. Phys., 1987, 87, 654. [all data]