iron diiodide
- Formula: FeI2
- Molecular weight: 309.654
- CAS Registry Number: 7783-86-0

Gas phase thermochemistry data

Quantity | Value | Units | Method | Reference | Comment |
---|---|---|---|---|---|
ΔfH°gas | 87.86 | kJ/mol | Review | Chase, 1998 | Data last reviewed in September, 1966 |
Quantity | Value | Units | Method | Reference | Comment |
S°gas,1 bar | 349.60 | J/mol*K | Review | Chase, 1998 | Data last reviewed in September, 1966 |
Gas Phase Heat Capacity (Shomate Equation)
Cp° = A + B*t + C*t2 + D*t3 +
E/t2
H° − H°298.15= A*t + B*t2/2 +
C*t3/3 + D*t4/4 − E/t + F − H
S° = A*ln(t) + B*t + C*t2/2 + D*t3/3 −
E/(2*t2) + G
Cp = heat capacity (J/mol*K)
H° = standard enthalpy (kJ/mol)
S° = standard entropy (J/mol*K)
t = temperature (K) / 1000.
View plot Requires a JavaScript / HTML 5 canvas capable browser.
Temperature (K) | 2000. to 6000. |
---|---|
A | 58.75717 |
B | 7.142088 |
C | -1.865684 |
D | 0.141686 |
E | -1.715090 |
F | 67.99042 |
G | 417.4021 |
H | 87.86400 |
Reference | Chase, 1998 |
Comment | Data last reviewed in September, 1966 |

Condensed phase thermochemistry data

Quantity | Value | Units | Method | Reference | Comment |
---|---|---|---|---|---|
ΔfH°liquid | -71.05 | kJ/mol | Review | Chase, 1998 | Data last reviewed in September, 1966 |
Quantity | Value | Units | Method | Reference | Comment |
S°liquid,1 bar | 195.43 | J/mol*K | Review | Chase, 1998 | Data last reviewed in September, 1966 |
Quantity | Value | Units | Method | Reference | Comment |
ΔfH°solid | -104.60 | kJ/mol | Review | Chase, 1998 | Data last reviewed in September, 1966 |
Quantity | Value | Units | Method | Reference | Comment |
S°solid | 167.36 | J/mol*K | Review | Chase, 1998 | Data last reviewed in September, 1966 |
Liquid Phase Heat Capacity (Shomate Equation)
Cp° = A + B*t + C*t2 + D*t3 +
E/t2
H° − H°298.15= A*t + B*t2/2 +
C*t3/3 + D*t4/4 − E/t + F − H
S° = A*ln(t) + B*t + C*t2/2 + D*t3/3 −
E/(2*t2) + G
Cp = heat capacity (J/mol*K)
H° = standard enthalpy (kJ/mol)
S° = standard entropy (J/mol*K)
t = temperature (K) / 1000.
View plot Requires a JavaScript / HTML 5 canvas capable browser.
Temperature (K) | 860. to 2000. |
---|---|
A | 112.9680 |
B | 5.490496×10-10 |
C | -3.583702×10-10 |
D | 7.610654×10-11 |
E | 1.348181×10-11 |
F | -104.7276 |
G | 332.1401 |
H | -71.04599 |
Reference | Chase, 1998 |
Comment | Data last reviewed in September, 1966 |
Solid Phase Heat Capacity (Shomate Equation)
Cp° = A + B*t + C*t2 + D*t3 +
E/t2
H° − H°298.15= A*t + B*t2/2 +
C*t3/3 + D*t4/4 − E/t + F − H
S° = A*ln(t) + B*t + C*t2/2 + D*t3/3 −
E/(2*t2) + G
Cp = heat capacity (J/mol*K)
H° = standard enthalpy (kJ/mol)
S° = standard entropy (J/mol*K)
t = temperature (K) / 1000.
View plot Requires a JavaScript / HTML 5 canvas capable browser.
Temperature (K) | 298. to 650. | 650. to 860. |
---|---|---|
A | 81.76247 | -1180.896 |
B | 7.503125 | 2638.794 |
C | -7.728727 | -1863.206 |
D | 4.069865 | 449.3783 |
E | 0.022888 | 91.88775 |
F | -129.1743 | 427.8684 |
G | 264.5054 | -1528.520 |
H | -104.6000 | -104.6000 |
Reference | Chase, 1998 | Chase, 1998 |
Comment | Data last reviewed in September, 1966 | Data last reviewed in September, 1966 |

Gas phase ion energetics data

Data compiled as indicated in comments:
LBLHLM - Sharon G. Lias, John E. Bartmess, Joel F. Liebman, John L. Holmes, Rhoda D. Levin, and W. Gary Mallard
Ionization energy determinations
IE (eV) | Method | Reference | Comment |
---|---|---|---|
9.3 ± 0.2 | EI | Grade and Rosinger, 1985 | LBLHLM |
9.3 ± 0.2 | EI | Grade, Rosinger, et al., 1984 | LBLHLM |
Appearance energy determinations
Ion | AE (eV) | Other Products | Method | Reference | Comment |
---|---|---|---|---|---|
Fe+ | 13.63 ± 0.15 | 2I | PI | Grade and Rosinger, 1985 | LBLHLM |
Fe+ | 7.9 ± 0.2 | I2 | EI | Grade and Rosinger, 1984 | LBLHLM |
FeI+ | 10.9 ± 0.2 | I | EI | Grade and Rosinger, 1985 | LBLHLM |
FeI+ | 10.96 ± 0.10 | I | PI | Grade and Rosinger, 1985 | LBLHLM |
FeI+ | 10.9 | I | EI | Grade, Rosinger, et al., 1984 | LBLHLM |

Reaction thermochemistry data

Data compiled by: José A. Martinho Simões
Individual Reactions
C4FeI2O4 (cr) = 4 (g) + FeI2 (cr)
By formula: C4FeI2O4 (cr) = 4CO (g) + FeI2 (cr)
Quantity | Value | Units | Method | Reference | Comment |
---|---|---|---|---|---|
ΔrH° | 163.3 ± 1.0 | kJ/mol | TD-HFC | Connor, Demain, et al., 1979 |

References

Chase, 1998
Chase, M.W., Jr.,
NIST-JANAF Themochemical Tables, Fourth Edition,
J. Phys. Chem. Ref. Data, Monograph 9, 1998, 1-1951. [all data]
Grade and Rosinger, 1985
Grade, M.; Rosinger, W.,
Correlation of electronic structures and stabilities of gaseous FeI2, Fe2I2 and Fe2I4 molecules, solid [FeI2], and iodine adsorbed on [Fe],
Surf. Sci., 1985, 156, 920. [all data]
Grade, Rosinger, et al., 1984
Grade, M.; Rosinger, W.; Dowben, P.A.,
Core and valence electron binding energies of FeI2 and stabilities of gas phase species,
Ber. Bunsen-Ges. Phys. Chem., 1984, 88, 65. [all data]
Grade and Rosinger, 1984
Grade, M.; Rosinger, W.,
A mass spectrometric investigation of iron(II)-iodide,
Ber. Bunsen-Ges. Phys. Chem., 1984, 88, 767. [all data]