Molybdenum hexafluoride
- Formula: F6Mo
- Molecular weight: 209.95
- IUPAC Standard InChIKey: RLCOZMCCEKDUPY-UHFFFAOYSA-H
- CAS Registry Number: 7783-77-9
- Chemical structure:

Gas phase thermochemistry data

Quantity | Value | Units | Method | Reference | Comment |
---|---|---|---|---|---|
ΔfH°gas | -1557.66 | kJ/mol | Review | Chase, 1998 | Data last reviewed in September, 1978 |
Quantity | Value | Units | Method | Reference | Comment |
S°gas,1 bar | 350.47 | J/mol*K | Review | Chase, 1998 | Data last reviewed in September, 1978 |
Gas Phase Heat Capacity (Shomate Equation)
Cp° = A + B*t + C*t2 + D*t3 +
E/t2
H° − H°298.15= A*t + B*t2/2 +
C*t3/3 + D*t4/4 − E/t + F − H
S° = A*ln(t) + B*t + C*t2/2 + D*t3/3 −
E/(2*t2) + G
Cp = heat capacity (J/mol*K)
H° = standard enthalpy (kJ/mol)
S° = standard entropy (J/mol*K)
t = temperature (K) / 1000.
View plot Requires a JavaScript / HTML 5 canvas capable browser.
Temperature (K) | 1000. to 6000. |
---|---|
A | 150.6792 |
B | 6.156463 |
C | -1.657760 |
D | 0.140911 |
E | -2.950587 |
F | -1612.740 |
G | 514.4521 |
H | -1557.661 |
Reference | Chase, 1998 |
Comment | Data last reviewed in September, 1978 |

Gas phase ion energetics data

Data compiled by: Sharon G. Lias, Rhoda D. Levin, and Sherif A. Kafafi
Ionization energy determinations
IE (eV) | Method | Reference |
---|---|---|
14.5 ± 0.1 | PE | Vovna, Dudin, et al., 1979 |
Appearance energy determinations
Ion | AE (eV) | Other Products | Method | Reference | Comment |
---|---|---|---|---|---|
F5Mo+ | 15.2 ± 0.2 | F | EI | Hildenbrand, 1976 |

Condensed phase thermochemistry data

Quantity Value Units Method Reference Comment
Δfliquid-1585.66kJ/molReviewChase, 1998Data last reviewed in September, 1978
Quantity Value Units Method Reference Comment
liquid,1 bar259.69J/mol*KReviewChase, 1998Data last reviewed in September, 1978

Liquid Phase Heat Capacity (Shomate Equation)

Cp° = A + B*t + C*t2 + D*t3 + E/t2
H° − H°298.15= A*t + B*t2/2 + C*t3/3 + D*t4/4 − E/t + F − H
S° = A*ln(t) + B*t + C*t2/2 + D*t3/3 − E/(2*t2) + G
    Cp = heat capacity (J/mol*K)
    H° = standard enthalpy (kJ/mol)
    S° = standard entropy (J/mol*K)
    t = temperature (K) / 1000.

View plot Requires a JavaScript / HTML 5 canvas capable browser.

View table.

Temperature (K) 298. - 1000.
A 117.9344
B 173.9423
C 0.009630
D -0.004071
E -0.000071
F -1628.551
G 350.5506
H -1585.657
ReferenceChase, 1998
Comment Data last reviewed in September, 1978

Phase change data

Data compiled by: William E. Acree, Jr., James S. Chickos

Enthalpy of vaporization

ΔvapH (kcal/mol) Temperature (K) Reference Comment
6.55340.Nisel'son, Nikolaev, et al., 1968Based on data from 318. - 363. K.

Vibrational and/or electronic energy levels

Data compiled by: Takehiko Shimanouchi

Symmetry:   Oh     Symmetry Number σ = 24

 Sym.   No   Approximate   Selected Freq.  Infrared   Raman   Comments
 Species   type of mode   Value   Rating   Value  Phase  Value  Phase

a1g 1 Sym str 742  B  ia 741.5 VS p gas
eg 2 Deg str 652  B  ia 651.6 W dp gas
f1u 3 Deg str 741  C 741 VS gas  ia
f1u 4 Deg deform 264  C 264 S gas  ia
f2g 5 Deg deform 318  C  ia 318 W dp gas
f2u 6 Deg deform 116  E  ia  ia OC(2ν6)

Source: Shimanouchi, 1972

References

Chase, 1998
Chase, M.W., Jr.,
NIST-JANAF Themochemical Tables, Fourth Edition,
J. Phys. Chem. Ref. Data, Monograph 9, 1998, 1-1951. [all data]
Vovna, Dudin, et al., 1979
Vovna, V.I.; Dudin, A.S.; Avkhutskii, L.M.; Lopatin, S.N.; Ippolitov, E.G.,
Photoelectron spectra and electronic spectra of volatile rhenium fluorides [and oxide fluorides],
Russ. J. Inorg. Chem., 1979, 24, 1135. [all data]
Hildenbrand, 1976
Hildenbrand, D.L.,
Thermochemical studies of the gaseous lower valent fluorides of molybdenum,
J. Chem. Phys., 1976, 65, 614. [all data]