iodine pentafluoride
- Formula: F5I
- Molecular weight: 221.89649
- IUPAC Standard InChIKey: PJIYEPACCBMRLZ-UHFFFAOYSA-N
- CAS Registry Number: 7783-66-6
- Chemical structure:
View 3d structure (requires JavaScript / HTML 5) - Permanent link for this species. Use this link for bookmarking this species for future reference.

Gas phase thermochemistry data

Quantity | Value | Units | Method | Reference | Comment |
---|---|---|---|---|---|
ΔfH°gas | -840.31 | kJ/mol | Review | Chase, 1998 | Data last reviewed in December, 1969 |
Quantity | Value | Units | Method | Reference | Comment |
S°gas,1 bar | 334.51 | J/mol*K | Review | Chase, 1998 | Data last reviewed in December, 1969 |
Gas Phase Heat Capacity (Shomate Equation)
Cp° = A + B*t + C*t2 + D*t3 +
E/t2
H° − H°298.15= A*t + B*t2/2 +
C*t3/3 + D*t4/4 − E/t + F − H
S° = A*ln(t) + B*t + C*t2/2 + D*t3/3 −
E/(2*t2) + G
Cp = heat capacity (J/mol*K)
H° = standard enthalpy (kJ/mol)
S° = standard entropy (J/mol*K)
t = temperature (K) / 1000.
View plot Requires a JavaScript / HTML 5 canvas capable browser.
Temperature (K) | 298. to 6000. |
---|---|
A | 128.4802 |
B | 3.856984 |
C | -1.041089 |
D | 0.088628 |
E | -2.433833 |
F | -886.9452 |
G | 475.1936 |
H | -840.3146 |
Reference | Chase, 1998 |
Comment | Data last reviewed in December, 1969 |

Phase change data

Data compiled as indicated in comments:
BS - Robert L. Brown and Stephen E. Stein
AC - William E. Acree, Jr., James S. Chickos
Quantity | Value | Units | Method | Reference | Comment |
---|---|---|---|---|---|
Tboil | 371. | K | N/A | PCR Inc., 1990 | BS |
Enthalpy of vaporization
ΔvapH (kJ/mol) | Temperature (K) | Reference | Comment |
---|---|---|---|
39.3 | 330. | Osborne, 1971 | Based on data from 283. to 378. K.; AC |

Gas phase ion energetics data

Data compiled as indicated in comments:
LLK - Sharon G. Lias, Rhoda D. Levin, and Sherif A. Kafafi
RDSH - Henry M. Rosenstock, Keith Draxl, Bruce W. Steiner, and John T. Herron
Ionization energy determinations
IE (eV) | Method | Reference | Comment |
---|---|---|---|
12.943 ± 0.005 | PE | DeKock, Higginson, et al., 1972 | LLK |
13.5 ± 0.2 | EI | Irsa and Friedman, 1958 | RDSH |
Appearance energy determinations
Ion | AE (eV) | Other Products | Method | Reference | Comment |
---|---|---|---|---|---|
IF+ | ~24. | ? | EI | Irsa and Friedman, 1958 | RDSH |
IF2+ | 15.1 ± 0.3 | ? | EI | Irsa and Friedman, 1958 | RDSH |
IF3+ | 11.5 ± 0.3 | ? | EI | Irsa and Friedman, 1958 | RDSH |
IF4+ | 13.6 ± 0.3 | F-? | EI | Irsa and Friedman, 1958 | RDSH |

References

Chase, 1998
Chase, M.W., Jr.,
NIST-JANAF Themochemical Tables, Fourth Edition,
J. Phys. Chem. Ref. Data, Monograph 9, 1998, 1-1951. [all data]
PCR Inc., 1990
PCR Inc.,
Research Chemicals Catalog 1990-1991, PCR Inc., Gainesville, FL, 1990, 1. [all data]
Osborne, 1971
Osborne, Darrell W.,
Calorimetric Study of Iodine Pentafluoride: Heat Capacity between 5 and 350°K, Enthalpy of Fusion and Vaporization, Standard Entropy of the Vapor, and Other Thermodynamic Properties,
J. Chem. Phys., 1971, 54, 9, 3790, https://doi.org/10.1063/1.1675430
. [all data]
DeKock, Higginson, et al., 1972
DeKock, R.L.; Higginson, B.R.; Lloyd, D.R.,
Photoelectron spectra of halides. Part 6.--The spectra of SF5Cl, BrF5 and IF5,
Faraday Discuss. Chem. Soc., 1972, 54, 84. [all data]
Irsa and Friedman, 1958
Irsa, A.P.; Friedman, L.,
Mass spectra of halogen fluorides,
J. Inorg. Nucl. Chem., 1958, 6, 77. [all data]