tetrafluorogermane
- Formula: F4Ge
- Molecular weight: 148.63
- IUPAC Standard InChIKey: PPMWWXLUCOODDK-UHFFFAOYSA-N
- CAS Registry Number: 7783-58-6
- Chemical structure:
View 3d structure (requires JavaScript / HTML 5) - Other names: Germanium tetrafluoride

Gas phase thermochemistry data

Quantity | Value | Units | Method | Reference | Comment |
---|---|---|---|---|---|
ΔfH°gas | -1190.20 ± 0.50 | kJ/mol | Review | Cox, Wagman, et al., 1984 | CODATA Review value |
Quantity | Value | Units | Method | Reference | Comment |
S°gas,1 bar | 301.9 ± 1.0 | J/mol*K | Review | Cox, Wagman, et al., 1984 | CODATA Review value |

Reaction thermochemistry data

Data compiled by: John E. Bartmess
Individual Reactions
By formula: F- + F4Ge = (F- • F4Ge)
Quantity | Value | Units | Method | Reference | Comment |
---|---|---|---|---|---|
ΔrH° | 418. ± 29. | kJ/mol | Ther | Mallouk, Rosenthal, et al., 1984 | gas phase; Fluoride affinities from this method appear to be consistently about 10 kcal/mol too bound |
ΔrH° | >404.6 | kJ/mol | IMRB | Harland, Cradock, et al., 1972 | gas phase |

Gas phase ion energetics data

Data compiled by: Sharon G. Lias, Rhoda D. Levin, and Sherif A. Kafafi
Ionization energy determinations
IE (eV) | Method | Reference | Comment |
---|---|---|---|
15.5 | PE | Lloyd and Roberts, 1975 | |
15.69 ± 0.02 | PE | Bassett and Lloyd, 1971 | |
16.1 | PE | Lloyd and Roberts, 1975 | Vertical value |
16.06 ± 0.04 | PE | Jonas, Schweitzer, et al., 1973 | Vertical value |
Appearance energy determinations
Ion | AE (eV) | Other Products | Method | Reference | Comment |
---|---|---|---|---|---|
FGe+ | 23.4 ± 0.4 | ? | EI | Harland, Cradock, et al., 1973 | |
F2Ge+ | 20.7 ± 0.3 | ? | EI | Harland, Cradock, et al., 1973 | |
F3Ge+ | 15.7 ± 0.2 | F | EI | Harland, Cradock, et al., 1973 | |
Ge+ | 29.4 ± 0.2 | ? | EI | Harland, Cradock, et al., 1973 |

Ion clustering data

Data compiled by: John E. Bartmess
Clustering reactions
By formula: F- + F4Ge = (F- • F4Ge)
Quantity | Value | Units | Method | Reference | Comment |
---|---|---|---|---|---|
ΔrH° | 418. ± 29. | kJ/mol | Ther | Mallouk, Rosenthal, et al., 1984 | gas phase; Fluoride affinities from this method appear to be consistently about 10 kcal/mol too bound |
ΔrH° | >404.6 | kJ/mol | IMRB | Harland, Cradock, et al., 1972 | gas phase |

References

Cox, Wagman, et al., 1984
Cox, J.D.; Wagman, D.D.; Medvedev, V.A.,
CODATA Key Values for Thermodynamics, Hemisphere Publishing Corp., New York, 1984, 1. [all data]
Mallouk, Rosenthal, et al., 1984
Mallouk, T.E.; Rosenthal, G.L.; Muller, G.; Brusasco, R.; Bartlett, N.,
Fluoride ion affinities of GeF4 and BF4 from thermodynamic and structural data for (SF2)2GeF6, ClO2GeF5, and ClO2BF4,
Inorg. Chem., 1984, 23, 3167. [all data]
Harland, Cradock, et al., 1972
Harland, P.W.; Cradock, S.; Thynne, J.C.J.,
Positive- and negative-ion formation due to the electron bombardment of germanium tetrafluoride,
Int. J. Mass Spectrom. Ion Phys., 1972, 10, 169. [all data]
Lloyd and Roberts, 1975
Lloyd, D.R.; Roberts, P.J.,
Photoelectron spectra of halides. VII. Variable temperature He(I) and He(II) studies of CF4, SiF4, and GeF4,
J. Electron Spectrosc. Relat. Phenom., 1975, 7, 325. [all data]
Bassett and Lloyd, 1971
Bassett, P.J.; Lloyd, D.R.,
Photoelectron spectra of halides. Part I. Tetrafluorides and tetrachlorides of group IVB,
J. Chem. Soc., 1971, (A), 641. [all data]
Jonas, Schweitzer, et al., 1973
Jonas, A.E.; Schweitzer, G.K.; Grimm, F.A.; Carlson, T.A.,
The photoelectron spectra of the tetrafluoro and tetramethyl compounds of the group IV elements,
J. Electron Spectrosc. Relat. Phenom., 1973, 1, 29. [all data]
Harland, Cradock, et al., 1973
Harland, P.W.; Cradock, S.; Thynne, J.C.J.,
Positive-and negative-ion formation due to the electron bombardment of germanium tetrafluoride,
Int. J. Mass Spectrom. Ion Phys., 1973, 10, 169. [all data]