gallium trifluoride
- Formula: F3Ga
- Molecular weight: 126.718
- CAS Registry Number: 7783-51-9

Reaction thermochemistry data

Data compiled by: John E. Bartmess
Individual Reactions
By formula: F- + F3Ga = (F- • F3Ga)
Quantity | Value | Units | Method | Reference | Comment |
---|---|---|---|---|---|
ΔrH° | 110.3 ± 4.1 | kcal/mol | TDAs | Zhuravleva, Nikitin, et al., 1985 | gas phase; Fluoride Affinity: 7.5 kcal < AlF3; value altered from reference due to conversion from electron convention to ion convention |
By formula: AlF4- + F3Ga = (AlF4- • F3Ga)
Quantity | Value | Units | Method | Reference | Comment |
---|---|---|---|---|---|
ΔrH° | 48.3 ± 4.2 | kcal/mol | TDEq | Zhuravleva, Nikitin, et al., 1985 | gas phase; value altered from reference due to conversion from electron convention to ion convention |
By formula: F4Ga- + F3Ga = F7Ga2-
Quantity | Value | Units | Method | Reference | Comment |
---|---|---|---|---|---|
ΔrH° | 51.9 ± 4.7 | kcal/mol | TDEq | Zhuravleva, Nikitin, et al., 1985 | gas phase; value altered from reference due to conversion from electron convention to ion convention |

Gas phase ion energetics data

Data compiled by: Sharon G. Lias, Rhoda D. Levin, and Sherif A. Kafafi
Appearance energy determinations
Ion | AE (eV) | Other Products | Method | Reference | Comment |
---|---|---|---|---|---|
FGa+ | 15.1 ± 0.5 | ? | EI | Feather, Buchler, et al., 1972 |

Ion clustering data

Data compiled by: John E. Bartmess
Clustering reactions
By formula: AlF4- + F3Ga = (AlF4- • F3Ga)
Quantity | Value | Units | Method | Reference | Comment |
---|---|---|---|---|---|
ΔrH° | 48.3 ± 4.2 | kcal/mol | TDEq | Zhuravleva, Nikitin, et al., 1985 | gas phase; value altered from reference due to conversion from electron convention to ion convention |
By formula: F- + F3Ga = (F- • F3Ga)
Quantity | Value | Units | Method | Reference | Comment |
---|---|---|---|---|---|
ΔrH° | 110.3 ± 4.1 | kcal/mol | TDAs | Zhuravleva, Nikitin, et al., 1985 | gas phase; Fluoride Affinity: 7.5 kcal < AlF3; value altered from reference due to conversion from electron convention to ion convention |
By formula: F4Ga- + F3Ga = F7Ga2-
Quantity | Value | Units | Method | Reference | Comment |
---|---|---|---|---|---|
ΔrH° | 51.9 ± 4.7 | kcal/mol | TDEq | Zhuravleva, Nikitin, et al., 1985 | gas phase; value altered from reference due to conversion from electron convention to ion convention |

Phase change data

Data compiled by: William E. Acree, Jr., James S. Chickos

Quantity Value Units Method Reference Comment
Δsub252. ± 4.kJ/molTEBrunetti, Piacente, et al., 2010Based on data from 808. - 958. K.

References

Zhuravleva, Nikitin, et al., 1985
Zhuravleva, L.V.; Nikitin, M.I.; Sorokin, I.D.; Sidorov, L.N.,
Mass Spectrometric Determination of the Enthalpies of Dissociation of Gaseous Complex Fluorides into Neutral and Charged Particles. VIII. MF-..GaF3 Systems (M=Li, Na, K, Rb, Cs),
Int. J. Mass Spectrom. Ion Proc., 1985, 65, 3, 253, https://doi.org/10.1016/0168-1176(85)87002-6
. [all data]
Feather, Buchler, et al., 1972
Feather, D.H.; Buchler, A.; Searcy, A.W.,
The vapor pressures of gallium trifluoride monomer and dimer,
High Temp. Sci., 1972, 4, 290. [all data]