iron trifluoride
- Formula: F3Fe
- Molecular weight: 112.840
- CAS Registry Number: 7783-50-8

Gas phase thermochemistry data

Quantity | Value | Units | Method | Reference | Comment |
---|---|---|---|---|---|
ΔfH°gas | -820.90 | kJ/mol | Review | Chase, 1998 | Data last reviewed in September, 1965 |
Quantity | Value | Units | Method | Reference | Comment |
S°gas,1 bar | 304.11 | J/mol*K | Review | Chase, 1998 | Data last reviewed in September, 1965 |
Gas Phase Heat Capacity (Shomate Equation)
Cp° = A + B*t + C*t2 + D*t3 +
E/t2
H° − H°298.15= A*t + B*t2/2 +
C*t3/3 + D*t4/4 − E/t + F − H
S° = A*ln(t) + B*t + C*t2/2 + D*t3/3 −
E/(2*t2) + G
Cp = heat capacity (J/mol*K)
H° = standard enthalpy (kJ/mol)
S° = standard entropy (J/mol*K)
t = temperature (K) / 1000.
View plot Requires a JavaScript / HTML 5 canvas capable browser.
Temperature (K) | 298. to 6000. |
---|---|
A | 79.15291 |
B | 3.357782 |
C | -0.902552 |
D | 0.076636 |
E | -1.343094 |
F | -849.1428 |
G | 391.3785 |
H | -820.9008 |
Reference | Chase, 1998 |
Comment | Data last reviewed in September, 1965 |

Condensed phase thermochemistry data

Quantity | Value | Units | Method | Reference | Comment |
---|---|---|---|---|---|
ΔfH°solid | -1041.82 | kJ/mol | Review | Chase, 1998 | Data last reviewed in September, 1965 |
Quantity | Value | Units | Method | Reference | Comment |
S°solid | 98.28 | J/mol*K | Review | Chase, 1998 | Data last reviewed in September, 1965 |
Solid Phase Heat Capacity (Shomate Equation)
Cp° = A + B*t + C*t2 + D*t3 +
E/t2
H° − H°298.15= A*t + B*t2/2 +
C*t3/3 + D*t4/4 − E/t + F − H
S° = A*ln(t) + B*t + C*t2/2 + D*t3/3 −
E/(2*t2) + G
Cp = heat capacity (J/mol*K)
H° = standard enthalpy (kJ/mol)
S° = standard entropy (J/mol*K)
t = temperature (K) / 1000.
View plot Requires a JavaScript / HTML 5 canvas capable browser.
Temperature (K) | 298. to 367. | 367. to 450. | 450. to 2000. |
---|---|---|---|
A | -29794.50 | 15482.70 | 86.66000 |
B | 192680.0 | -77230.90 | 17.09560 |
C | -464154.0 | 144403.0 | -2.794011 |
D | 396689.0 | -95453.80 | 0.582977 |
E | 283.0840 | -238.2660 | 0.293204 |
F | 3543.800 | -4111.640 | -1066.880 |
G | -74687.50 | 34946.00 | 201.3110 |
H | -1041.820 | -1041.820 | -1041.820 |
Reference | Chase, 1998 | Chase, 1998 | Chase, 1998 |
Comment | Data last reviewed in September, 1965 | Data last reviewed in September, 1965 | Data last reviewed in September, 1965 |

Gas phase ion energetics data

Data compiled as indicated in comments:
RDSH - Henry M. Rosenstock, Keith Draxl, Bruce W. Steiner, and John T. Herron
B - John E. Bartmess
Electron affinity determinations
EA (eV) | Method | Reference | Comment |
---|---|---|---|
3.62 ± 0.13 | R-A | Borshchevskii, Boltalina, et al., 1988 | Fluoride Affinity: FeF2 < FeF3 by 22.6±2.6 kcal/mol.; value altered from reference due to conversion from electron convention to ion convention; B |
Ionization energy determinations
IE (eV) | Method | Reference | Comment |
---|---|---|---|
12.5 ± 0.3 | EI | Zmbov and Margrave, 1967 | RDSH |
Appearance energy determinations
Ion | AE (eV) | Other Products | Method | Reference | Comment |
---|---|---|---|---|---|
FeF+ | 16.0 ± 0.3 | ? | EI | Zmbov and Margrave, 1967 | RDSH |
FeF2+ | 13.7 ± 0.3 | F | EI | Zmbov and Margrave, 1967 | RDSH |
Fe+ | 20.5 ± 0.3 | ? | EI | Zmbov and Margrave, 1967 | RDSH |

Reaction thermochemistry data

Data compiled by: John E. Bartmess
Individual Reactions
By formula: F- + F3Fe = (F- • F3Fe)
Quantity | Value | Units | Method | Reference | Comment |
---|---|---|---|---|---|
ΔrH° | 108.3 ± 3.6 | kcal/mol | TDAs | Boltalina, Borshchevskii, et al., 1992 | gas phase; Critical review; value altered from reference due to conversion from electron convention to ion convention |
ΔrH° | 104.9 ± 3.4 | kcal/mol | TDEq | Sorokin, Sidorov, et al., 1981 | gas phase; Fluoride Affinity: 14.9 kcal < AlF3; value altered from reference due to conversion from electron convention to ion convention |
ΔrH° | 109.0 ± 3.3 | kcal/mol | TDEq | Chilingarov, Korobov, et al., 1984 | gas phase; Fluoride Affinity: 8.8 kcal < AlF3; value altered from reference due to conversion from electron convention to ion convention |
By formula: F4Fe- + F3Fe = F7Fe2-
Quantity | Value | Units | Method | Reference | Comment |
---|---|---|---|---|---|
ΔrH° | 45.1 ± 5.7 | kcal/mol | TDAs | Sidirov, Borshchevsky, et al., 1986 | gas phase; value altered from reference due to conversion from electron convention to ion convention |
ΔrH° | 48.7 ± 1.0 | kcal/mol | TDAs | Sorokin, Sidorov, et al., 1981 | gas phase; ΔHf(A-) at 0 K; value altered from reference due to conversion from electron convention to ion convention |

Ion clustering data

Data compiled by: John E. Bartmess
Clustering reactions
By formula: F- + F3Fe = (F- • F3Fe)
Quantity | Value | Units | Method | Reference | Comment |
---|---|---|---|---|---|
ΔrH° | 108.3 ± 3.6 | kcal/mol | TDAs | Boltalina, Borshchevskii, et al., 1992 | gas phase; Critical review; value altered from reference due to conversion from electron convention to ion convention |
ΔrH° | 104.9 ± 3.4 | kcal/mol | TDEq | Sorokin, Sidorov, et al., 1981 | gas phase; Fluoride Affinity: 14.9 kcal < AlF3; value altered from reference due to conversion from electron convention to ion convention |
ΔrH° | 109.0 ± 3.3 | kcal/mol | TDEq | Chilingarov, Korobov, et al., 1984 | gas phase; Fluoride Affinity: 8.8 kcal < AlF3; value altered from reference due to conversion from electron convention to ion convention |
By formula: F4Fe- + F3Fe = F7Fe2-
Quantity | Value | Units | Method | Reference | Comment |
---|---|---|---|---|---|
ΔrH° | 45.1 ± 5.7 | kcal/mol | TDAs | Sidirov, Borshchevsky, et al., 1986 | gas phase; value altered from reference due to conversion from electron convention to ion convention |
ΔrH° | 48.7 ± 1.0 | kcal/mol | TDAs | Sorokin, Sidorov, et al., 1981 | gas phase; ΔHf(A-) at 0 K; value altered from reference due to conversion from electron convention to ion convention |

References

Chase, 1998
Chase, M.W., Jr.,
NIST-JANAF Themochemical Tables, Fourth Edition,
J. Phys. Chem. Ref. Data, Monograph 9, 1998, 1-1951. [all data]
Borshchevskii, Boltalina, et al., 1988
Borshchevskii, A.Ya.; Boltalina, O.V.; Sorokin, I.D.; Sidorov, L.N.,
Thermochemical Quantities for Gas Phase Iron, Uranium, and Molybdenum Fluorides, and Their Negative Ions.,
J. Chem. Thermodyn., 1988, 20, 5, 523, https://doi.org/10.1016/0021-9614(88)90080-8
. [all data]
Zmbov and Margrave, 1967
Zmbov, K.F.; Margrave, J.L.,
Mass spectrometric studies at high temperatures. XV.Sublimation pressures of chromium, manganese and iron trifluoridcs and the heat of dissociation of Fe,F,(g),
J. Inorg. Nucl. Chem., 1967, 29, 673. [all data]