zinc fluoride
- Formula: F2Zn
- Molecular weight: 103.38
- CAS Registry Number: 7783-49-5

Reaction thermochemistry data

Data compiled by: John E. Bartmess
Individual Reactions
By formula: F- + F2Zn = (F- • F2Zn)
Quantity | Value | Units | Method | Reference | Comment |
---|---|---|---|---|---|
ΔrH° | 337. ± 19. | kJ/mol | TDAs | Boltalina, Borshchevskii, et al., 1992 | gas phase; Critical review; value altered from reference due to conversion from electron convention to ion convention |

Gas phase ion energetics data

Data compiled by: Sharon G. Lias, Rhoda D. Levin, and Sherif A. Kafafi
Ionization energy determinations
IE (eV) | Method | Reference | Comment |
---|---|---|---|
13.91 ± 0.03 | PE | Lee, Law, et al., 1980 | |
13.5 | PE | Dyke, Fayad, et al., 1980 | |
13.91 | PE | Dyke, Fayad, et al., 1980 | Vertical value |

Phase change data

Data compiled by: William E. Acree, Jr., James S. Chickos

Enthalpy of sublimation

ΔsubH (kJ/mol) Temperature (K) Method Reference Comment
252.41015.MEBiefeld and Eick, 1973Based on data from 901. - 1125. K.

References

Boltalina, Borshchevskii, et al., 1992
Boltalina, O.V.; Borshchevskii, A.Y.; Sidorov, L.N.,
Thermochemistry of 3d Elements Fluorides and Their Negative Ions in Gas Phase,
Russ. J. Phys. Chem., 1992, 66, 1223. [all data]
Lee, Law, et al., 1980
Lee, E.P.F.; Law, D.; Potts, A.W.,
Photoelectron spectra and valence shell electronic structure of zinc and cadmium difluoride,
J. Chem. Soc. Faraday Trans. 2, 1980, 76, 1314. [all data]
Dyke, Fayad, et al., 1980
Dyke, J.M.; Fayad, N.K.; Josland, G.D.; Morris, A.,
Study by high-temperature photoelectron spectroscopy of the electronic structure of the transition metal difluorides, CuF2 and ZnF2,
J. Chem. Soc. Faraday Trans. 2, 1980, 76, 1672. [all data]