strontium fluoride
- Formula: F2Sr
- Molecular weight: 125.62
- CAS Registry Number: 7783-48-4

Condensed phase thermochemistry data

Quantity | Value | Units | Method | Reference | Comment |
---|---|---|---|---|---|
ΔfH°liquid | -1172.04 | kJ/mol | Review | Chase, 1998 | Data last reviewed in December, 1972 |
Quantity | Value | Units | Method | Reference | Comment |
S°liquid,1 bar | 109.42 | J/mol*K | Review | Chase, 1998 | Data last reviewed in December, 1972 |
Quantity | Value | Units | Method | Reference | Comment |
ΔfH°solid | -1217.13 | kJ/mol | Review | Chase, 1998 | Data last reviewed in December, 1972 |
Quantity | Value | Units | Method | Reference | Comment |
S°solid | 82.13 | J/mol*K | Review | Chase, 1998 | Data last reviewed in December, 1972 |
Liquid Phase Heat Capacity (Shomate Equation)
Cp° = A + B*t + C*t2 + D*t3 +
E/t2
H° − H°298.15= A*t + B*t2/2 +
C*t3/3 + D*t4/4 − E/t + F − H
S° = A*ln(t) + B*t + C*t2/2 + D*t3/3 −
E/(2*t2) + G
Cp = heat capacity (J/mol*K)
H° = standard enthalpy (kJ/mol)
S° = standard entropy (J/mol*K)
t = temperature (K) / 1000.
View plot Requires a JavaScript / HTML 5 canvas capable browser.
Temperature (K) | 1750. to 3500. |
---|---|
A | 99.04825 |
B | -1.040997×10-7 |
C | 3.548752×10-8 |
D | -4.131634×10-9 |
E | -4.227848×10-8 |
F | -1217.448 |
G | 201.7767 |
H | -1172.043 |
Reference | Chase, 1998 |
Comment | Data last reviewed in December, 1972 |
Solid Phase Heat Capacity (Shomate Equation)
Cp° = A + B*t + C*t2 + D*t3 +
E/t2
H° − H°298.15= A*t + B*t2/2 +
C*t3/3 + D*t4/4 − E/t + F − H
S° = A*ln(t) + B*t + C*t2/2 + D*t3/3 −
E/(2*t2) + G
Cp = heat capacity (J/mol*K)
H° = standard enthalpy (kJ/mol)
S° = standard entropy (J/mol*K)
t = temperature (K) / 1000.
View plot Requires a JavaScript / HTML 5 canvas capable browser.
Temperature (K) | 298. to 1000. | 1000. to 1421. | 1421. to 1484. | 1484. to 1750. |
---|---|---|---|---|
A | 36.51940 | -58525.40 | 165.2680 | -9188.530 |
B | 168.7690 | 101109.0 | 0.000000 | 8931.570 |
C | -230.8840 | -65313.00 | 0.000000 | -3220.340 |
D | 111.2040 | 14992.70 | 0.000000 | 411.9040 |
E | 0.068095 | 7827.670 | 0.000000 | 4048.570 |
F | -1233.470 | 32659.70 | -1352.830 | 8430.340 |
G | 85.66510 | -69359.90 | 153.9590 | -5391.670 |
H | -1217.130 | -1217.130 | -1217.130 | -1217.130 |
Reference | Chase, 1998 | Chase, 1998 | Chase, 1998 | Chase, 1998 |
Comment | Data last reviewed in December, 1972 | Data last reviewed in December, 1972 | Data last reviewed in December, 1972 | Data last reviewed in December, 1972 |

Gas phase ion energetics data

Data compiled by: Henry M. Rosenstock, Keith Draxl, Bruce W. Steiner, and John T. Herron
Appearance energy determinations
Ion | AE (eV) | Other Products | Method | Reference | Comment |
---|---|---|---|---|---|
SrF+ | 13.0 ± 1.0 | F | EI | Hildenbrand, 1968 |

Gas phase thermochemistry data

Quantity Value Units Method Reference Comment
Δfgas-766.09kJ/molReviewChase, 1998Data last reviewed in December, 1972
Quantity Value Units Method Reference Comment
gas,1 bar291.70J/mol*KReviewChase, 1998Data last reviewed in December, 1972

Gas Phase Heat Capacity (Shomate Equation)

Cp° = A + B*t + C*t2 + D*t3 + E/t2
H° − H°298.15= A*t + B*t2/2 + C*t3/3 + D*t4/4 − E/t + F − H
S° = A*ln(t) + B*t + C*t2/2 + D*t3/3 − E/(2*t2) + G
    Cp = heat capacity (J/mol*K)
    H° = standard enthalpy (kJ/mol)
    S° = standard entropy (J/mol*K)
    t = temperature (K) / 1000.

View plot Requires a JavaScript / HTML 5 canvas capable browser.

View table.

Temperature (K) 3500. - 6000.
A 57.73041
B 0.401776
C -0.108910
D 0.009296
E -0.438316
F -784.7887
G 358.9801
H -766.0904
ReferenceChase, 1998
Comment Data last reviewed in December, 1972

References

Chase, 1998
Chase, M.W., Jr.,
NIST-JANAF Themochemical Tables, Fourth Edition,
J. Phys. Chem. Ref. Data, Monograph 9, 1998, 1-1951. [all data]
Hildenbrand, 1968
Hildenbrand, D.L.,
Mass-spectrometric studies of bonding in the group IIA fluorides,
J. Chem. Phys., 1968, 48, 3657. [all data]