lead difluoride
- Formula: F2Pb
- Molecular weight: 245.2
- CAS Registry Number: 7783-46-2

Gas phase thermochemistry data

Quantity | Value | Units | Method | Reference | Comment |
---|---|---|---|---|---|
ΔfH°gas | -435.14 | kJ/mol | Review | Chase, 1998 | Data last reviewed in December, 1973 |
Quantity | Value | Units | Method | Reference | Comment |
S°gas,1 bar | 292.66 | J/mol*K | Review | Chase, 1998 | Data last reviewed in December, 1973 |
Gas Phase Heat Capacity (Shomate Equation)
Cp° = A + B*t + C*t2 + D*t3 +
E/t2
H° − H°298.15= A*t + B*t2/2 +
C*t3/3 + D*t4/4 − E/t + F − H
S° = A*ln(t) + B*t + C*t2/2 + D*t3/3 −
E/(2*t2) + G
Cp = heat capacity (J/mol*K)
H° = standard enthalpy (kJ/mol)
S° = standard entropy (J/mol*K)
t = temperature (K) / 1000.
View plot Requires a JavaScript / HTML 5 canvas capable browser.
Temperature (K) | 1500. to 6000. |
---|---|
A | 57.28482 |
B | 0.779768 |
C | -0.210946 |
D | 0.017981 |
E | -0.595576 |
F | -454.2443 |
G | 358.4098 |
H | -435.1360 |
Reference | Chase, 1998 |
Comment | Data last reviewed in December, 1973 |

Condensed phase thermochemistry data

Quantity | Value | Units | Method | Reference | Comment |
---|---|---|---|---|---|
ΔfH°liquid | -660.32 | kJ/mol | Review | Chase, 1998 | Data last reviewed in December, 1973 |
Quantity | Value | Units | Method | Reference | Comment |
S°liquid,1 bar | 130.94 | J/mol*K | Review | Chase, 1998 | Data last reviewed in December, 1973 |
Quantity | Value | Units | Method | Reference | Comment |
ΔfH°solid | -676.97 | kJ/mol | Review | Chase, 1998 | α phase; Data last reviewed in December, 1973 |
Liquid Phase Heat Capacity (Shomate Equation)
Cp° = A + B*t + C*t2 + D*t3 +
E/t2
H° − H°298.15= A*t + B*t2/2 +
C*t3/3 + D*t4/4 − E/t + F − H
S° = A*ln(t) + B*t + C*t2/2 + D*t3/3 −
E/(2*t2) + G
Cp = heat capacity (J/mol*K)
H° = standard enthalpy (kJ/mol)
S° = standard entropy (J/mol*K)
t = temperature (K) / 1000.
View plot Requires a JavaScript / HTML 5 canvas capable browser.
Temperature (K) | 1103. to 1500. |
---|---|
A | 109.2020 |
B | 0.000000 |
C | 0.000000 |
D | 0.000000 |
E | 0.000000 |
F | -704.7195 |
G | 237.2466 |
H | -660.3189 |
Reference | Chase, 1998 |
Comment | Data last reviewed in December, 1973 |
Solid Phase Heat Capacity (Shomate Equation)
Cp° = A + B*t + C*t2 + D*t3 +
E/t2
H° − H°298.15= A*t + B*t2/2 +
C*t3/3 + D*t4/4 − E/t + F − H
S° = A*ln(t) + B*t + C*t2/2 + D*t3/3 −
E/(2*t2) + G
Cp = heat capacity (J/mol*K)
H° = standard enthalpy (kJ/mol)
S° = standard entropy (J/mol*K)
t = temperature (K) / 1000.
View plot Requires a JavaScript / HTML 5 canvas capable browser.
Temperature (K) | 298. to 1000. | 298. to 583. | 583. to 716. | 716. to 1103. |
---|---|---|---|---|
A | 71.72213 | -186.8250 | -97093.20 | -23622.80 |
B | 8.009725 | 1389.320 | 307430.0 | 48553.10 |
C | 24.22733 | -2745.560 | -367090.0 | -37178.10 |
D | -7.982026 | 1961.480 | 157028.0 | 10096.20 |
E | -0.336354 | 3.467411 | 3945.810 | 2246.330 |
F | -700.0669 | -650.0270 | 30185.70 | 10852.70 |
G | 194.3857 | -401.7080 | -173636.0 | -31980.70 |
H | -676.9712 | -675.9900 | -675.9900 | -675.9900 |
Reference | Chase, 1998 | Chase, 1998 | Chase, 1998 | Chase, 1998 |
Comment | α phase; Data last reviewed in December, 1973 | β phase; Data last reviewed in December, 1973 | β phase; Data last reviewed in December, 1973 | β phase; Data last reviewed in December, 1973 |

Gas phase ion energetics data

Data compiled as indicated in comments:
LBLHLM - Sharon G. Lias, John E. Bartmess, Joel F. Liebman, John L. Holmes, Rhoda D. Levin, and W. Gary Mallard
RDSH - Henry M. Rosenstock, Keith Draxl, Bruce W. Steiner, and John T. Herron
Ionization energy determinations
IE (eV) | Method | Reference | Comment |
---|---|---|---|
11.5 | PE | Novak and Potts, 1983 | LBLHLM |
11.6 ± 0.3 | EI | Zmbov, Hastie, et al., 1968 | RDSH |
11.84 | PE | Novak and Potts, 1983 | Vertical value; LBLHLM |
Appearance energy determinations
Ion | AE (eV) | Other Products | Method | Reference | Comment |
---|---|---|---|---|---|
PbF+ | 12.1 ± 0.3 | F | EI | Zmbov, Hastie, et al., 1968 | RDSH |

Vibrational and/or electronic energy levels

Data compiled by: Takehiko Shimanouchi
Symmetry: C2ν Symmetry Number σ = 2
Sym. | No | Approximate | Selected Freq. | Infrared | Raman | Comments | ||||
---|---|---|---|---|---|---|---|---|---|---|
Species | type of mode | Value | Rating | Value | Phase | Value | Phase | |||
a1 | 1 | Sym str | 531 | D | 531.2 | solid solid | ||||
a1 | 2 | Bend | 165 | D | 165 | solid solid | ||||
b1 | 3 | Anti str | 507 | D | 507.2 | solid solid | ||||
Source: Shimanouchi, 1972

References

Chase, 1998
Chase, M.W., Jr.,
NIST-JANAF Themochemical Tables, Fourth Edition,
J. Phys. Chem. Ref. Data, Monograph 9, 1998, 1-1951. [all data]
Novak and Potts, 1983
Novak, I.; Potts, A.W.,
The ultraviolet photoelectron spectra and electron structure of gas phase and condensed SnF2 and PbF2,
J. Chem. Soc. Dalton Trans., 1983, 2211. [all data]
Zmbov, Hastie, et al., 1968
Zmbov, K.F.; Hastie, J.W.; Margrave, J.L.,
Mass spectrometric studies at high temperatures. Part 24. Thermodynamics of vaporization of SnF, and PbF, and the dissociation energies of SnF and PbF,
J. Chem. Soc. Faraday Trans., 1968, 64, 861. [all data]
Shimanouchi, 1972
Shimanouchi, T.,
Tables of Molecular Vibrational Frequencies Consolidated Volume II,
J. Phys. Chem. Ref. Data, 1972, 6, 3, 993-1102. [all data]