Oxygen difluoride
- Formula: F2O
- Molecular weight: 53.9962
- IUPAC Standard InChIKey: UJMWVICAENGCRF-UHFFFAOYSA-N
- CAS Registry Number: 7783-41-7
- Chemical structure:
View 3d structure (requires JavaScript / HTML 5) - Other names: Difluorine monoxide; Oxygen fluoride (OF2); Difluorine monooxide; Fluorine monoxide; Fluorine oxide; Oxydifluoride; OF2; Oxygen fluoride; UN 2190

Gas phase thermochemistry data

Quantity | Value | Units | Method | Reference | Comment |
---|---|---|---|---|---|
ΔfH°gas | 24.52 | kJ/mol | Review | Chase, 1998 | Data last reviewed in September, 1995 |
Quantity | Value | Units | Method | Reference | Comment |
S°gas,1 bar | 247.46 | J/mol*K | Review | Chase, 1998 | Data last reviewed in September, 1995 |
Gas Phase Heat Capacity (Shomate Equation)
Cp° = A + B*t + C*t2 + D*t3 +
E/t2
H° − H°298.15= A*t + B*t2/2 +
C*t3/3 + D*t4/4 − E/t + F − H
S° = A*ln(t) + B*t + C*t2/2 + D*t3/3 −
E/(2*t2) + G
Cp = heat capacity (J/mol*K)
H° = standard enthalpy (kJ/mol)
S° = standard entropy (J/mol*K)
t = temperature (K) / 1000.
View plot Requires a JavaScript / HTML 5 canvas capable browser.
Temperature (K) | 298. to 600. | 600. to 6000. |
---|---|---|
A | 15.06976 | 57.26808 |
B | 136.2612 | 0.640466 |
C | -172.8088 | -0.150702 |
D | 81.40767 | 0.011677 |
E | 0.071893 | -1.898625 |
F | 15.57553 | 1.585041 |
G | 232.4333 | 307.3976 |
H | 24.51803 | 24.51803 |
Reference | Chase, 1998 | Chase, 1998 |
Comment | Data last reviewed in September, 1995 | Data last reviewed in September, 1995 |

Phase change data

Data compiled as indicated in comments:
TRC - Thermodynamics Research Center, NIST Boulder Laboratories, Chris Muzny director
Quantity | Value | Units | Method | Reference | Comment |
---|---|---|---|---|---|
Tboil | 127.9 | K | N/A | Streng, 1971 | Uncertainty assigned by TRC = 0.3 K; TRC |
Quantity | Value | Units | Method | Reference | Comment |
Tfus | 49.4 | K | N/A | Streng, 1971 | Uncertainty assigned by TRC = 0.25 K; TRC |
Antoine Equation Parameters
log10(P) = A − (B / (T + C))
P = vapor pressure (bar)
T = temperature (K)
View plot Requires a JavaScript / HTML 5 canvas capable browser.
Temperature (K) | A | B | C | Reference | Comment |
---|---|---|---|---|---|
77.0 to 128.5 | 5.26568 | 758.401 | 15.742 | Stull, 1947 | Coefficents calculated by NIST from author's data. |

Gas phase ion energetics data

Data evaluated as indicated in comments:
L - Sharon G. Lias
Data compiled as indicated in comments:
LLK - Sharon G. Lias, Rhoda D. Levin, and Sherif A. Kafafi
RDSH - Henry M. Rosenstock, Keith Draxl, Bruce W. Steiner, and John T. Herron
Quantity | Value | Units | Method | Reference | Comment |
---|---|---|---|---|---|
IE (evaluated) | 13.11 ± 0.01 | eV | N/A | N/A | L |
Ionization energy determinations
IE (eV) | Method | Reference | Comment |
---|---|---|---|
13.11 ± 0.01 | PI | Berkowitz, Dehmer, et al., 1973 | LLK |
13.11 | PE | Brundle, Robin, et al., 1972 | LLK |
13.13 | PE | Cornford, Frost, et al., 1971 | LLK |
13.26 | PE | Chadwick, Cornford, et al., 1972 | Vertical value; LLK |
Appearance energy determinations
Ion | AE (eV) | Other Products | Method | Reference | Comment |
---|---|---|---|---|---|
OF+ | ≤14.438 | F | PI | Berkowitz, Dehmer, et al., 1973 | LLK |
OF+ | 15.8 ± 0.2 | F | EI | Malone and McGee, 1965 | RDSH |
OF+ | 15.8 ± 0.2 | F | EI | Dibeler, Reese, et al., 1957 | RDSH |

References

Chase, 1998
Chase, M.W., Jr.,
NIST-JANAF Themochemical Tables, Fourth Edition,
J. Phys. Chem. Ref. Data, Monograph 9, 1998, 1-1951. [all data]
Streng, 1971
Streng, A.G.,
Miscibility and Compatibility of Some Liquid and Solidified Gases at Low Temperature,
J. Chem. Eng. Data, 1971, 16, 357. [all data]
Stull, 1947
Stull, Daniel R.,
Vapor Pressure of Pure Substances. Organic and Inorganic Compounds,
Ind. Eng. Chem., 1947, 39, 4, 517-540, https://doi.org/10.1021/ie50448a022
. [all data]
Berkowitz, Dehmer, et al., 1973
Berkowitz, J.; Dehmer, P.M.; Chupka, W.A.,
Photoionization mass spectrometry of F2O,
J. Chem. Phys., 1973, 59, 925. [all data]
Brundle, Robin, et al., 1972
Brundle, C.R.; Robin, M.B.; Kuebler, N.A.; Basch, H.,
Perfluoro effect in photoelectron spectroscopy. I. Nonaromatic molecules,
J. Am. Chem. Soc., 1972, 94, 1451. [all data]
Cornford, Frost, et al., 1971
Cornford, A.B.; Frost, D.C.; Herring, F.G.; McDowell, C.A.,
Photoelectron spectra of F2O and Cl2O,
J. Chem. Phys., 1971, 55, 2820. [all data]
Chadwick, Cornford, et al., 1972
Chadwick, D.; Cornford, A.B.; Frost, D.C.; Herring, F.G.; Katrib, A.; McDowell, C.A.; McLean, R.A.N.,
Photoelectron spectra of some dihalocompounds
in Electron spectroscopy, ed. D.A. Shirley (North-Holland Publixhing Co, Amsterdam), 1972, 453. [all data]
Malone and McGee, 1965
Malone, T.J.; McGee, H.A., Jr.,
Mass spectrometric investigations of the synthesis, stability, and energetics of the low-temperature oxygen fluorides. I. Dioxygen difluoride,
J. Phys. Chem., 1965, 69, 4338. [all data]
Dibeler, Reese, et al., 1957
Dibeler, V.H.; Reese, R.M.; Franklin, J.L.,
Ionization and dissociation of oxygen difluoride by electron impact,
J. Chem. Phys., 1957, 27, 1296. [all data]