Magnesium fluoride
- Formula: F2Mg
- Molecular weight: 62.3018
- IUPAC Standard InChIKey: ORUIBWPALBXDOA-UHFFFAOYSA-L
- CAS Registry Number: 7783-40-6
- Chemical structure:
View 3d structure (requires JavaScript / HTML 5) - Permanent link for this species. Use this link for bookmarking this species for future reference.

Condensed phase thermochemistry data

Quantity | Value | Units | Method | Reference | Comment |
---|---|---|---|---|---|
ΔfH°liquid | -1072.36 | kJ/mol | Review | Chase, 1998 | Data last reviewed in June, 1975 |
Quantity | Value | Units | Method | Reference | Comment |
S°liquid,1 bar | 89.93 | J/mol*K | Review | Chase, 1998 | Data last reviewed in June, 1975 |
Quantity | Value | Units | Method | Reference | Comment |
ΔfH°solid | -1124.2 ± 1.2 | kJ/mol | Review | Cox, Wagman, et al., 1984 | CODATA Review value |
ΔfH°solid | -1124.24 | kJ/mol | Review | Chase, 1998 | Data last reviewed in June, 1975 |
Quantity | Value | Units | Method | Reference | Comment |
S°solid,1 bar | 57.2 ± 0.5 | J/mol*K | Review | Cox, Wagman, et al., 1984 | CODATA Review value |
Quantity | Value | Units | Method | Reference | Comment |
S°solid | 57.17 | J/mol*K | Review | Chase, 1998 | Data last reviewed in June, 1975 |
Liquid Phase Heat Capacity (Shomate Equation)
Cp° = A + B*t + C*t2 + D*t3 +
E/t2
H° − H°298.15= A*t + B*t2/2 +
C*t3/3 + D*t4/4 − E/t + F − H
S° = A*ln(t) + B*t + C*t2/2 + D*t3/3 −
E/(2*t2) + G
Cp = heat capacity (J/mol*K)
H° = standard enthalpy (kJ/mol)
S° = standard entropy (J/mol*K)
t = temperature (K) / 1000.
View plot Requires a JavaScript / HTML 5 canvas capable browser.
Temperature (K) | 1536. to 3000. |
---|---|
A | 94.92199 |
B | -5.302467×10-8 |
C | 2.126544×10-8 |
D | -2.906320×10-9 |
E | -1.298504×10-8 |
F | -1114.823 |
G | 178.2443 |
H | -1072.355 |
Reference | Chase, 1998 |
Comment | Data last reviewed in June, 1975 |
Solid Phase Heat Capacity (Shomate Equation)
Cp° = A + B*t + C*t2 + D*t3 +
E/t2
H° − H°298.15= A*t + B*t2/2 +
C*t3/3 + D*t4/4 − E/t + F − H
S° = A*ln(t) + B*t + C*t2/2 + D*t3/3 −
E/(2*t2) + G
Cp = heat capacity (J/mol*K)
H° = standard enthalpy (kJ/mol)
S° = standard entropy (J/mol*K)
t = temperature (K) / 1000.
View plot Requires a JavaScript / HTML 5 canvas capable browser.
Temperature (K) | 298. to 1536. |
---|---|
A | 68.55149 |
B | 22.72586 |
C | -12.16218 |
D | 2.573717 |
E | -1.140865 |
F | -1149.445 |
G | 127.4522 |
H | -1124.241 |
Reference | Chase, 1998 |
Comment | Data last reviewed in June, 1975 |

Phase change data

Data compiled by: William E. Acree, Jr., James S. Chickos
Quantity | Value | Units | Method | Reference | Comment |
---|---|---|---|---|---|
ΔsubH° | 348.2 ± 4.3 | kJ/mol | N/A | Greenbaum, Ko, et al., 1964 |
Enthalpy of sublimation
ΔsubH (kJ/mol) | Temperature (K) | Method | Reference | Comment |
---|---|---|---|---|
327.3 ± 4.3 | 1400. | TE | Greenbaum, Ko, et al., 1964 | Based on data from 1273. to 1513. K. |
359.8 | 1330. | MS | Berkowitz and Marquart, 1962 | Based on data from 1220. to 1450. K. |

Gas phase ion energetics data

Data evaluated as indicated in comments:
L - Sharon G. Lias
Data compiled as indicated in comments:
RDSH - Henry M. Rosenstock, Keith Draxl, Bruce W. Steiner, and John T. Herron
Quantity | Value | Units | Method | Reference | Comment |
---|---|---|---|---|---|
IE (evaluated) | 13.6 ± 0.3 | eV | N/A | N/A | L |
Ionization energy determinations
IE (eV) | Method | Reference | Comment |
---|---|---|---|
13.3 ± 0.3 | EI | Hildenbrand, 1968 | RDSH |
14.0 ± 0.5 | EI | Murad, Hildenbrand, et al., 1966 | RDSH |
13.5 ± 0.4 | EI | Berkowitz and Marquart, 1962 | RDSH |
Appearance energy determinations
Ion | AE (eV) | Other Products | Method | Reference | Comment |
---|---|---|---|---|---|
MgF+ | 13.5 ± 1.0 | F | EI | Hildenbrand, 1968 | RDSH |
MgF+ | 13.7 ± 0.4 | F | EI | Ehlert, Blue, et al., 1964 | RDSH |
MgF+ | 13.5 ± 0.4 | F | EI | Berkowitz and Marquart, 1962 | RDSH |

Gas phase thermochemistry data

Quantity | Value | Units | Method | Reference | Comment |
---|---|---|---|---|---|
ΔfH°gas | -726.76 | kJ/mol | Review | Chase, 1998 | Data last reviewed in June, 1975 |
Quantity | Value | Units | Method | Reference | Comment |
S°gas,1 bar | 256.43 | J/mol*K | Review | Chase, 1998 | Data last reviewed in June, 1975 |
Gas Phase Heat Capacity (Shomate Equation)
Cp° = A + B*t + C*t2 + D*t3 +
E/t2
H° − H°298.15= A*t + B*t2/2 +
C*t3/3 + D*t4/4 − E/t + F − H
S° = A*ln(t) + B*t + C*t2/2 + D*t3/3 −
E/(2*t2) + G
Cp = heat capacity (J/mol*K)
H° = standard enthalpy (kJ/mol)
S° = standard entropy (J/mol*K)
t = temperature (K) / 1000.
View plot Requires a JavaScript / HTML 5 canvas capable browser.
Temperature (K) | 3000. to 6000. |
---|---|
A | 55.71038 |
B | 2.086921 |
C | -0.559681 |
D | 0.047453 |
E | -0.744296 |
F | -745.9528 |
G | 319.0643 |
H | -726.7608 |
Reference | Chase, 1998 |
Comment | Data last reviewed in June, 1975 |

Vibrational and/or electronic energy levels

Data compiled by: Marilyn E. Jacox

State:   X

Vib.
sym.
 No.   Approximate
 type of mode
 cm-1   Med.   Method   References

Πu 2 Bend 254 w m Ne IR Snelson, 1966
2 Bend 243 w m Ar IR Snelson, 1966
2 Bend 238 w m Kr IR Snelson, 1966
Σu+ 3 Asym. stretch 862 s Ne IR Snelson, 1966
3 Asym. stretch 840 s Ar IR Snelson, 1966
3 Asym. stretch 834 m Kr IR Snelson, 1966

Additional references: Jacox, 1994, page 84; Buchler, Stauffer, et al., 1964

References

Chase, 1998
Chase, M.W., Jr.,
NIST-JANAF Themochemical Tables, Fourth Edition,
J. Phys. Chem. Ref. Data, Monograph 9, 1998, 1-1951. [all data]
Cox, Wagman, et al., 1984
Cox, J.D.; Wagman, D.D.; Medvedev, V.A.,
CODATA Key Values for Thermodynamics, Hemisphere Publishing Corp., New York, 1984, 1. [all data]
Greenbaum, Ko, et al., 1964
Greenbaum, Michael A.; Ko, Hon Chung; Wong, Madeline; Farber, Milton,
The Vapor Pressure and Heat and Entropy of Sublimation of Solid Magnesium Fluoride,
J. Phys. Chem., 1964, 68, 4, 965-968, https://doi.org/10.1021/j100786a510
. [all data]
Berkowitz and Marquart, 1962
Berkowitz, J.; Marquart, J.R.,
Mass-spectrometric study of the magnesium halides,
J. Chem. Phys., 1962, 37, 1853. [all data]
Hildenbrand, 1968
Hildenbrand, D.L.,
Mass-spectrometric studies of bonding in the group IIA fluorides,
J. Chem. Phys., 1968, 48, 3657. [all data]
Murad, Hildenbrand, et al., 1966
Murad, E.; Hildenbrand, D.L.; Main, R.P.,
Dissociation energies of group IIIA monofluorides-the possibility of potential maxima in their excited H states,,
J. Chem. Phys., 1966, 45, 263. [all data]
Ehlert, Blue, et al., 1964
Ehlert, T.C.; Blue, G.D.; Green, J.W.; Margrave, J.L.,
Mass spectrometric studies at high temperatures. IV. Dissociation energies of the alkaline earth monofluorides,
J. Chem. Phys., 1964, 41, 2250. [all data]