Tetrasilane
- Formula: H10Si4
- Molecular weight: 122.4214
- IUPAC Standard InChIKey: MBDFFBCLMHNNID-UHFFFAOYSA-N
- CAS Registry Number: 7783-29-1
- Chemical structure:
View 3d structure (requires JavaScript / HTML 5) - Other names: Tetrasilan; n-Tetrasilane

Phase change data

Data compiled by: William E. Acree, Jr., James S. Chickos
Enthalpy of vaporization
ΔvapH (kJ/mol) | Temperature (K) | Method | Reference |
---|---|---|---|
35.6 | 273. to 369. | T | Emel«65533»us and Maddock, 1946 |

Gas phase ion energetics data

Data compiled as indicated in comments:
LLK - Sharon G. Lias, Rhoda D. Levin, and Sherif A. Kafafi
Ionization energy determinations
IE (eV) | Method | Reference | Comment |
---|---|---|---|
8.9 | PE | Bock, Ensslin, et al., 1976 | LLK |
9.62 | PE | Bock, Ensslin, et al., 1976 | Vertical value; LLK |

References

Emel«65533»us and Maddock, 1946
Emel«65533»us, H.J.; Maddock, A.G.,
251. The chemistry of the higher silanes. Part I. Tetrasilane,
J. Chem. Soc., 1946, 1131, https://doi.org/10.1039/jr9460001131
. [all data]
Bock, Ensslin, et al., 1976
Bock, H.; Ensslin, W.; Feher, F.; Freund, R.,
Photoelectron spectra and molecular properties. LI. Ionization potentials of silanes SinH2n+2,
J. Am. Chem. Soc., 1976, 98, 668. [all data]