Trisilane
- Formula: H8Si3
- Molecular weight: 92.3200
- IUPAC Standard InChIKey: VEDJZFSRVVQBIL-UHFFFAOYSA-N
- CAS Registry Number: 7783-26-8
- Chemical structure:
View 3d structure (requires JavaScript / HTML 5) - Other names: Silicopropane; Trisilicane; Trisilicon octahydride; Trisilicopropane; Si3H8; Trisilan

Phase change data

Antoine Equation Parameters
log10(P) = A − (B / (T + C))
P = vapor pressure (bar)
T = temperature (K)
View plot Requires a JavaScript / HTML 5 canvas capable browser.
Temperature (K) | A | B | C | Reference | Comment |
---|---|---|---|---|---|
204.3 to 326.3 | 4.17983 | 1257.796 | -25.726 | Stull, 1947 | Coefficents calculated by NIST from author's data. |

Gas phase ion energetics data

Data compiled by: Sharon G. Lias, Rhoda D. Levin, and Sherif A. Kafafi
Ionization energy determinations
IE (eV) | Method | Reference | Comment |
---|---|---|---|
9.2 | PE | Bock, Ensslin, et al., 1976 | |
9.87 | PE | Bock, Ensslin, et al., 1976 | Vertical value |

References

Stull, 1947
Stull, Daniel R.,
Vapor Pressure of Pure Substances. Organic and Inorganic Compounds,
Ind. Eng. Chem., 1947, 39, 4, 517-540, https://doi.org/10.1021/ie50448a022
. [all data]
Bock, Ensslin, et al., 1976
Bock, H.; Ensslin, W.; Feher, F.; Freund, R.,
Photoelectron spectra and molecular properties. LI. Ionization potentials of silanes SinH2n+2,
J. Am. Chem. Soc., 1976, 98, 668. [all data]