dihydrogen selenide
- Formula: H2Se
- Molecular weight: 80.98
- IUPAC Standard InChIKey: SPVXKVOXSXTJOY-UHFFFAOYSA-N
- CAS Registry Number: 7783-07-5
- Chemical structure:
View 3d structure (requires JavaScript / HTML 5) - Other names: Hydrogen selenide

Phase change data

Antoine Equation Parameters
log10(P) = A − (B / (T + C))
P = vapor pressure (bar)
T = temperature (K)
View plot Requires a JavaScript / HTML 5 canvas capable browser.
Temperature (K) | A | B | C | Reference | Comment |
---|---|---|---|---|---|
157.8 to 232.1 | 3.61665 | 596.484 | -66.353 | Stull, 1947 | Coefficents calculated by NIST from author's data. |

Reaction thermochemistry data

Data compiled by: John E. Bartmess
Individual Reactions
HSe- + =
Quantity | Value | Units | Method | Reference | Comment |
---|---|---|---|---|---|
ΔrH° | 1428.8 ± 2.9 | kJ/mol | D-EA | Stoneman and Larson, 1986 | gas phase; Wagman, Evans, et al., 1982 ΔHf(AH) = 7.1 kcal/mol |
ΔrH° | 1434. ± 38. | kJ/mol | G+TS | Dixon, Holtz, et al., 1972 | gas phase; Between H2S, HCl; value altered from reference due to change in acidity scale |
ΔrH° | 1424.7 | kJ/mol | N/A | Check, Faust, et al., 2001 | gas phase; MnO-(t); ; ΔS(EA)=5.5 |
Quantity | Value | Units | Method | Reference | Comment |
ΔrG° | 1402.4 ± 3.3 | kJ/mol | H-TS | Stoneman and Larson, 1986 | gas phase; Wagman, Evans, et al., 1982 ΔHf(AH) = 7.1 kcal/mol |
ΔrG° | 1407. ± 38. | kJ/mol | IMRB | Dixon, Holtz, et al., 1972 | gas phase; Between H2S, HCl; value altered from reference due to change in acidity scale |
ΔrG° | 1398.3 | kJ/mol | N/A | Check, Faust, et al., 2001 | gas phase; MnO-(t); ; ΔS(EA)=5.5 |
By formula: NO2- + H2Se = (NO2- • H2Se)
Quantity | Value | Units | Method | Reference | Comment |
---|---|---|---|---|---|
ΔrH° | 87.4 ± 4.2 | kJ/mol | TDEq | Wlodek, Luczynski, et al., 1983 | gas phase; Equilibration with SO2..NO2- |
Quantity | Value | Units | Method | Reference | Comment |
ΔrG° | 43. ± 15. | kJ/mol | TDEq | Wlodek, Luczynski, et al., 1983 | gas phase; Equilibration with SO2..NO2- |
By formula: (NO2- • 2H2Se) + H2Se = (NO2- • 3H2Se)
Quantity | Value | Units | Method | Reference | Comment |
---|---|---|---|---|---|
ΔrH° | 30.5 ± 2.9 | kJ/mol | TDAs | Wlodek, Luczynski, et al., 1983 | gas phase |
Quantity | Value | Units | Method | Reference | Comment |
ΔrG° | 13.0 ± 2.1 | kJ/mol | TDAs | Wlodek, Luczynski, et al., 1983 | gas phase |
By formula: (NO3- • H2Se) + H2Se = (NO3- • 2H2Se)
Quantity | Value | Units | Method | Reference | Comment |
---|---|---|---|---|---|
ΔrH° | 30.1 ± 2.1 | kJ/mol | TDAs | Wlodek, Luczynski, et al., 1983 | gas phase |
Quantity | Value | Units | Method | Reference | Comment |
ΔrG° | 19.2 ± 2.9 | kJ/mol | TDAs | Wlodek, Luczynski, et al., 1983 | gas phase |
By formula: (NO2- • H2Se) + H2Se = (NO2- • 2H2Se)
Quantity | Value | Units | Method | Reference | Comment |
---|---|---|---|---|---|
ΔrH° | 35.6 ± 2.1 | kJ/mol | TDAs | Wlodek, Luczynski, et al., 1983 | gas phase |
Quantity | Value | Units | Method | Reference | Comment |
ΔrG° | 19.7 ± 1.3 | kJ/mol | TDAs | Wlodek, Luczynski, et al., 1983 | gas phase |
By formula: NO3- + H2Se = (NO3- • H2Se)
Quantity | Value | Units | Method | Reference | Comment |
---|---|---|---|---|---|
ΔrH° | 72.0 ± 2.5 | kJ/mol | TDAs | Wlodek, Luczynski, et al., 1983 | gas phase |
Quantity | Value | Units | Method | Reference | Comment |
ΔrG° | 31.8 ± 2.1 | kJ/mol | TDAs | Wlodek, Luczynski, et al., 1983 | gas phase |

Henry's Law data

Data compiled by: Rolf Sander
Henry's Law constant (water solution)
kH(T) = k°H exp(d(ln(kH))/d(1/T) ((1/T) - 1/(298.15 K)))
k°H = Henry's law constant for solubility in water at 298.15 K (mol/(kg*bar))
d(ln(kH))/d(1/T) = Temperature dependence constant (K)
k°H (mol/(kg*bar)) | d(ln(kH))/d(1/T) (K) | Method | Reference |
---|---|---|---|
0.084 | 1900. | L | N/A |

Gas phase ion energetics data

Data evaluated as indicated in comments:
HL - Edward P. Hunter and Sharon G. Lias
L - Sharon G. Lias
Data compiled as indicated in comments:
B - John E. Bartmess
LBLHLM - Sharon G. Lias, John E. Bartmess, Joel F. Liebman, John L. Holmes, Rhoda D. Levin, and W. Gary Mallard
LLK - Sharon G. Lias, Rhoda D. Levin, and Sherif A. Kafafi
RDSH - Henry M. Rosenstock, Keith Draxl, Bruce W. Steiner, and John T. Herron
Quantity | Value | Units | Method | Reference | Comment |
---|---|---|---|---|---|
IE (evaluated) | 9.892 ± 0.005 | eV | N/A | N/A | L |
Quantity | Value | Units | Method | Reference | Comment |
Proton affinity (review) | 707.8 | kJ/mol | N/A | Hunter and Lias, 1998 | HL |
Quantity | Value | Units | Method | Reference | Comment |
Gas basicity | 676.4 | kJ/mol | N/A | Hunter and Lias, 1998 | HL |
Ionization energy determinations
IE (eV) | Method | Reference | Comment |
---|---|---|---|
9.886 ± 0.003 | PI | Gibson, Greene, et al., 1986 | LBLHLM |
9.897 ± 0.002 | TE | Borlin, Jungen, et al., 1986 | LBLHLM |
10.00 ± 0.05 | EI | Balkis, Gaines, et al., 1976 | LLK |
9.93 | PE | Natalis, 1973 | LLK |
9.88 | PE | Potts and Price, 1972 | LLK |
9.93 | PE | Delwiche, Natalis, et al., 1970 | RDSH |
9.882 ± 0.001 | S | Price, Teegan, et al., 1950 | RDSH |
Appearance energy determinations
Ion | AE (eV) | Other Products | Method | Reference | Comment |
---|---|---|---|---|---|
HSe+ | 13.266 ± 0.007 | H | PI | Gibson, Greene, et al., 1986 | LBLHLM |
HSe+ | 13.6 ± 0.2 | H | EI | Balkis, Gaines, et al., 1976 | LLK |
HSe+ | 13.8 ± 0.2 | H | EI | Dixon, Holtz, et al., 1972 | LLK |
Se+ | 11.916 ± 0.006 | H2 | PI | Gibson, Greene, et al., 1986 | LBLHLM |
Se+ | 12.6 ± 0.1 | ? | EI | Dixon, Holtz, et al., 1972 | LLK |
De-protonation reactions
HSe- + =
Quantity | Value | Units | Method | Reference | Comment |
---|---|---|---|---|---|
ΔrH° | 1428.8 ± 2.9 | kJ/mol | D-EA | Stoneman and Larson, 1986 | gas phase; Wagman, Evans, et al., 1982 ΔHf(AH) = 7.1 kcal/mol; B |
ΔrH° | 1434. ± 38. | kJ/mol | G+TS | Dixon, Holtz, et al., 1972 | gas phase; Between H2S, HCl; value altered from reference due to change in acidity scale; B |
ΔrH° | 1424.7 | kJ/mol | N/A | Check, Faust, et al., 2001 | gas phase; MnO-(t); ; ΔS(EA)=5.5; B |
Quantity | Value | Units | Method | Reference | Comment |
ΔrG° | 1402.4 ± 3.3 | kJ/mol | H-TS | Stoneman and Larson, 1986 | gas phase; Wagman, Evans, et al., 1982 ΔHf(AH) = 7.1 kcal/mol; B |
ΔrG° | 1407. ± 38. | kJ/mol | IMRB | Dixon, Holtz, et al., 1972 | gas phase; Between H2S, HCl; value altered from reference due to change in acidity scale; B |
ΔrG° | 1398.3 | kJ/mol | N/A | Check, Faust, et al., 2001 | gas phase; MnO-(t); ; ΔS(EA)=5.5; B |

Ion clustering data

Data compiled by: John E. Bartmess
Clustering reactions
By formula: NO2- + H2Se = (NO2- • H2Se)
Quantity | Value | Units | Method | Reference | Comment |
---|---|---|---|---|---|
ΔrH° | 87.4 ± 4.2 | kJ/mol | TDEq | Wlodek, Luczynski, et al., 1983 | gas phase; Equilibration with SO2..NO2- |
Quantity | Value | Units | Method | Reference | Comment |
ΔrG° | 43. ± 15. | kJ/mol | TDEq | Wlodek, Luczynski, et al., 1983 | gas phase; Equilibration with SO2..NO2- |
By formula: (NO2- • H2Se) + H2Se = (NO2- • 2H2Se)
Quantity | Value | Units | Method | Reference | Comment |
---|---|---|---|---|---|
ΔrH° | 35.6 ± 2.1 | kJ/mol | TDAs | Wlodek, Luczynski, et al., 1983 | gas phase |
Quantity | Value | Units | Method | Reference | Comment |
ΔrG° | 19.7 ± 1.3 | kJ/mol | TDAs | Wlodek, Luczynski, et al., 1983 | gas phase |
By formula: (NO2- • 2H2Se) + H2Se = (NO2- • 3H2Se)
Quantity | Value | Units | Method | Reference | Comment |
---|---|---|---|---|---|
ΔrH° | 30.5 ± 2.9 | kJ/mol | TDAs | Wlodek, Luczynski, et al., 1983 | gas phase |
Quantity | Value | Units | Method | Reference | Comment |
ΔrG° | 13.0 ± 2.1 | kJ/mol | TDAs | Wlodek, Luczynski, et al., 1983 | gas phase |
By formula: NO3- + H2Se = (NO3- • H2Se)
Quantity | Value | Units | Method | Reference | Comment |
---|---|---|---|---|---|
ΔrH° | 72.0 ± 2.5 | kJ/mol | TDAs | Wlodek, Luczynski, et al., 1983 | gas phase |
Quantity | Value | Units | Method | Reference | Comment |
ΔrG° | 31.8 ± 2.1 | kJ/mol | TDAs | Wlodek, Luczynski, et al., 1983 | gas phase |
By formula: (NO3- • H2Se) + H2Se = (NO3- • 2H2Se)
Quantity | Value | Units | Method | Reference | Comment |
---|---|---|---|---|---|
ΔrH° | 30.1 ± 2.1 | kJ/mol | TDAs | Wlodek, Luczynski, et al., 1983 | gas phase |
Quantity | Value | Units | Method | Reference | Comment |
ΔrG° | 19.2 ± 2.9 | kJ/mol | TDAs | Wlodek, Luczynski, et al., 1983 | gas phase |

Vibrational and/or electronic energy levels

Data compiled by: Takehiko Shimanouchi
Symmetry: C2ν Symmetry Number σ = 2
Sym. | No | Approximate | Selected Freq. | Infrared | Raman | Comments | ||||
---|---|---|---|---|---|---|---|---|---|---|
Species | type of mode | Value | Rating | Value | Phase | Value | Phase | |||
a1 | 1 | Sym str | 2345 | B | 2344.5 S | gas | ||||
a1 | 2 | Bend | 1034 | A | 1034.2 S | gas | ||||
b1 | 3 | Anti str | 2358 | B | 2357.8 S | gas | ||||
Source: Shimanouchi, 1972

References

Stull, 1947
Stull, Daniel R.,
Vapor Pressure of Pure Substances. Organic and Inorganic Compounds,
Ind. Eng. Chem., 1947, 39, 4, 517-540, https://doi.org/10.1021/ie50448a022
. [all data]
Stoneman and Larson, 1986
Stoneman, R.C.; Larson, D.J.,
Photodetachment spectroscopy of SeH- in a magnetic field,
J. Phys. B:, 1986, 19, 405. [all data]
Wagman, Evans, et al., 1982
Wagman, D.D.; Evans, W.H.; Parker, V.B.; Schumm, R.H.; Halow, I.; Bailey, S.M.; Churney, K.L.; Nuttall, R.L.,
The NBS Tables of Chemical Thermodynamic Properties (NBS Tech Note 270),
J. Phys. Chem. Ref. Data, Supl. 1, 1982, 11. [all data]
Dixon, Holtz, et al., 1972
Dixon, D.A.; Holtz, D.; Beauchamp, J.L.,
Acidity, basicity, and gas-phase ion chemistry of hydrogen selenide by ion cyclotron resonance spectroscopy,
Inorg. Chem., 1972, 11, 960. [all data]
Check, Faust, et al., 2001
Check, C.E.; Faust, T.O.; Bailey, J.M.; Wright, B.J.; Gilbert, T.M.; Sunderlin, L.S.,
Addition of Polarization and Diffuse Functions to the LANL2DZ Basis Set for P-Block Elements,
J. Phys. Chem. A,, 2001, 105, 34, 8111, https://doi.org/10.1021/jp011945l
. [all data]
Wlodek, Luczynski, et al., 1983
Wlodek, S.; Luczynski, Z.; Wincel, H.,
Gas - Phase Solvation of NO2- and NO3- by Ethyl Nitrate,
Int. J. Mass Spectrom. Ion Phys., 1983, 52, 2-3, 149, https://doi.org/10.1016/0020-7381(83)85036-0
. [all data]
Hunter and Lias, 1998
Hunter, E.P.; Lias, S.G.,
Evaluated Gas Phase Basicities and Proton Affinities of Molecules: An Update,
J. Phys. Chem. Ref. Data, 1998, 27, 3, 413-656, https://doi.org/10.1063/1.556018
. [all data]
Gibson, Greene, et al., 1986
Gibson, S.T.; Greene, J.P.; Berkowitz, J.,
A photoionization study of SeH and H2Se,
J. Chem. Phys., 1986, 85, 4815. [all data]
Borlin, Jungen, et al., 1986
Borlin, K.; Jungen, M.; Karlsson, L.; Maripuu, R.,
Photoionization of H2Se: High-resolution and threshold photoelectron spectra,
Chem. Phys., 1986, 113, 309. [all data]
Balkis, Gaines, et al., 1976
Balkis, T.; Gaines, A.F.; Ozgen, G.; Ozgen, I.T.; Flowers, M.C.,
Ionization of hydrogen sul- phide, selenide and telluride by electron impact,
J. Chem. Soc. Faraday Trans. 2, 1976, 72, 524. [all data]
Natalis, 1973
Natalis, P.,
Contribution a la spectroscopie photoelectronique. Effets de l'autoionisation dans less spectres photoelectroniques de molecules diatomiques et triatomiques,
Acad. R. Belg. Mem. Cl. Sci. Collect. 8, 1973, 41, 1. [all data]
Potts and Price, 1972
Potts, A.W.; Price, W.C.,
Photoelectron spectra and valence shell orbital structures of groups V VI hydrides,
Proc. R. Soc. London A:, 1972, 326, 181. [all data]
Delwiche, Natalis, et al., 1970
Delwiche, J.; Natalis, P.; Collin, J.E.,
High resolution photoelectron spectrometry of H2S and H2Se,
Intern. J. Mass Spectrom. Ion Phys., 1970, 5, 443. [all data]
Price, Teegan, et al., 1950
Price, W.C.; Teegan, J.P.; Walsh, A.D.,
The far ultra-violet absorption spectra of the hydrides and deuterides of sulphur, selenium and tellurium and of the methyl derivatives of hydrogen sulphide,
Proc. Roy. Soc. (London), 1950, A201, 600. [all data]
Shimanouchi, 1972
Shimanouchi, T.,
Tables of Molecular Vibrational Frequencies Consolidated Volume I, National Bureau of Standards, 1972, 1-160. [all data]