H2N-NO2
- Formula: H2N2O2
- Molecular weight: 62.0281
- IUPAC Standard InChIKey: SFDJOSRHYKHMOK-UHFFFAOYSA-N
- CAS Registry Number: 7782-94-7
- Chemical structure:
View 3d structure (requires JavaScript / HTML 5) - Permanent link for this species. Use this link for bookmarking this species for future reference.

Reaction thermochemistry data

Data compiled by: John E. Bartmess
Individual Reactions
HN2O2- + =
By formula: HN2O2- + H+ = H2N2O2
Quantity | Value | Units | Method | Reference | Comment |
---|---|---|---|---|---|
ΔrH° | 1448. ± 9.2 | kJ/mol | G+TS | Attina, Cacace, et al., 1993 | gas phase; ΔfH(H2NNO2): estimated sublimation enthalpy in Gurvich, Veyts, et al. seems too small - JEB |
Quantity | Value | Units | Method | Reference | Comment |
ΔrG° | 1415. ± 8.4 | kJ/mol | IMRE | Attina, Cacace, et al., 1993 | gas phase; ΔfH(H2NNO2): estimated sublimation enthalpy in Gurvich, Veyts, et al. seems too small - JEB |

Gas phase ion energetics data

Data evaluated as indicated in comments:
HL - Edward P. Hunter and Sharon G. Lias
Data compiled as indicated in comments:
B - John E. Bartmess
Quantity | Value | Units | Method | Reference | Comment |
---|---|---|---|---|---|
Proton affinity (review) | 757.4 | kJ/mol | N/A | Hunter and Lias, 1998 | HL |
Quantity | Value | Units | Method | Reference | Comment |
Gas basicity | 725.0 | kJ/mol | N/A | Hunter and Lias, 1998 | HL |
De-protonation reactions
HN2O2- + =
By formula: HN2O2- + H+ = H2N2O2
Quantity | Value | Units | Method | Reference | Comment |
---|---|---|---|---|---|
ΔrH° | 1448. ± 9.2 | kJ/mol | G+TS | Attina, Cacace, et al., 1993 | gas phase; ΔfH(H2NNO2): estimated sublimation enthalpy in Gurvich, Veyts, et al. seems too small - JEB; B |
Quantity | Value | Units | Method | Reference | Comment |
ΔrG° | 1415. ± 8.4 | kJ/mol | IMRE | Attina, Cacace, et al., 1993 | gas phase; ΔfH(H2NNO2): estimated sublimation enthalpy in Gurvich, Veyts, et al. seems too small - JEB; B |

Vibrational and/or electronic energy levels

Data compiled by: Marilyn E. Jacox
State: ?
Energy (cm-1) |
Med. | Transition | λmin (nm) |
λmax (nm) |
References | ||
---|---|---|---|---|---|---|---|
Td = 40000 | T | Ar | Nonella, Muller, et al., 1985 | ||||
State: ?
Energy (cm-1) |
Med. | Transition | λmin (nm) |
λmax (nm) |
References | ||
---|---|---|---|---|---|---|---|
Td = 40000 | T | N2 | Nonella, Muller, et al., 1985 | ||||
State: X
Additional references: Jacox, 1994, page 337; Tyler, 1963

References

Attina, Cacace, et al., 1993
Attina, M.; Cacace, F.; Ciliberto, E.; Depetris, G.; Grandinetti, F.; Pepi, F.; Ricci, A.,
Gas-Phase Ion Chemistry of Nitramide - A Mass Spectrometric and Abinitio Study of H2N-NO2 and the H2N-NO2+., H2N-NO2.H+, and HN-NO2-,
J. Am. Chem. Soc., 1993, 115, 26, 12398, https://doi.org/10.1021/ja00079a022
. [all data]
Gurvich, Veyts, et al.
Gurvich, L.V.; Veyts, I.V.; Alcock, C.B.,
Hemisphere Publishing, NY, 1989, V. 1 2, Thermodynamic Properties of Individual Substances, 4th Ed. [all data]
Hunter and Lias, 1998
Hunter, E.P.; Lias, S.G.,
Evaluated Gas Phase Basicities and Proton Affinities of Molecules: An Update,
J. Phys. Chem. Ref. Data, 1998, 27, 3, 413-656, https://doi.org/10.1063/1.556018
. [all data]
Nonella, Muller, et al., 1985
Nonella, M.; Muller, R.P.; Huber, J.R.,
Infrared spectra, normal coordinate analysis, and photodecomposition of matrix-isolated NH2NO2, 15NH2NO2, ND2NO2, and 15ND2NO2,
J. Mol. Spectrosc., 1985, 112, 1, 142, https://doi.org/10.1016/0022-2852(85)90199-7
. [all data]
Jacox, 1994
Jacox, M.E.,
Vibrational and electronic energy levels of polyatomic transient molecules, American Chemical Society, Washington, DC, 1994, 464. [all data]
Tyler, 1963
Tyler, J.K.,
Microwave spectrum of nitramide,
J. Mol. Spectrosc., 1963, 11, 1-6, 39, https://doi.org/10.1016/0022-2852(63)90004-3
. [all data]