Nitrous acid
- Formula: HNO2
- Molecular weight: 47.0134
- IUPAC Standard InChIKey: IOVCWXUNBOPUCH-UHFFFAOYSA-N
- CAS Registry Number: 7782-77-6
- Chemical structure:
View 3d structure (requires JavaScript / HTML 5) - Other names: HNO2; Kyselina dusite; Nitrosyl hydroxide; Nitrous acid, trans; HONO

Gas phase thermochemistry data

Quantity | Value | Units | Method | Reference | Comment |
---|---|---|---|---|---|
ΔfH°gas | -76.73 | kJ/mol | Review | Chase, 1998 | Data last reviewed in June, 1963 |
Quantity | Value | Units | Method | Reference | Comment |
S°gas,1 bar | 249.41 | J/mol*K | Review | Chase, 1998 | Data last reviewed in June, 1963 |
Gas Phase Heat Capacity (Shomate Equation)
Cp° = A + B*t + C*t2 + D*t3 +
E/t2
H° − H°298.15= A*t + B*t2/2 +
C*t3/3 + D*t4/4 − E/t + F − H
S° = A*ln(t) + B*t + C*t2/2 + D*t3/3 −
E/(2*t2) + G
Cp = heat capacity (J/mol*K)
H° = standard enthalpy (kJ/mol)
S° = standard entropy (J/mol*K)
t = temperature (K) / 1000.
View plot Requires a JavaScript / HTML 5 canvas capable browser.
Temperature (K) | 298. to 1200. | 1200. to 6000. | 298. to 2000. | 2000. to 6000. |
---|---|---|---|---|
A | 24.89974 | 73.65137 | 37.79020 | 79.10390 |
B | 91.37563 | 4.854988 | 54.22820 | 1.667420 |
C | -64.84614 | -0.921409 | -27.25140 | -0.263444 |
D | 17.92007 | 0.060837 | 5.100990 | 0.014898 |
E | -0.134737 | -9.111790 | -0.510291 | -15.04800 |
F | -88.13596 | -119.3896 | -93.99160 | -130.3780 |
G | 254.2671 | 310.3440 | 277.0960 | 311.3580 |
H | -76.73498 | -76.73498 | -78.82660 | -78.82660 |
Reference | Chase, 1998 | Chase, 1998 | Chase, 1998 | Chase, 1998 |
Comment | Data last reviewed in June, 1963 | Data last reviewed in June, 1963 | Data last reviewed in June, 1963 | Data last reviewed in June, 1963 |

Reaction thermochemistry data

Data compiled as indicated in comments:
B - John E. Bartmess
ALS - Hussein Y. Afeefy, Joel F. Liebman, and Stephen E. Stein
Individual Reactions
Quantity | Value | Units | Method | Reference | Comment |
---|---|---|---|---|---|
ΔrH° | 1423.5 ± 0.88 | kJ/mol | D-EA | Ervin, Ho, et al., 1988 | gas phase; B |
Quantity | Value | Units | Method | Reference | Comment |
ΔrG° | 1396.3 ± 1.3 | kJ/mol | H-TS | Ervin, Ho, et al., 1988 | gas phase; B |
By formula: NO2- + HNO2 = (NO2- • HNO2)
Quantity | Value | Units | Method | Reference | Comment |
---|---|---|---|---|---|
ΔrH° | 136. ± 4.2 | kJ/mol | TDAs | Lee, Keesee, et al., 1980 | gas phase; B |
By formula: C8H11N + HNO2 = C8H10N2O + H2O
Quantity | Value | Units | Method | Reference | Comment |
---|---|---|---|---|---|
ΔrH° | -78.83 | kJ/mol | Cm | Swientoslawski, 1910 | liquid phase; ALS |
By formula: C12H11N + HNO2 = H2O + C12H10N2O
Quantity | Value | Units | Method | Reference | Comment |
---|---|---|---|---|---|
ΔrH° | -62.84 | kJ/mol | Cm | Swientoslawski, 1910 | solid phase; ALS |

Henry's Law data

Data compiled by: Rolf Sander
Henry's Law constant (water solution)
kH(T) = k°H exp(d(ln(kH))/d(1/T) ((1/T) - 1/(298.15 K)))
k°H = Henry's law constant for solubility in water at 298.15 K (mol/(kg*bar))
d(ln(kH))/d(1/T) = Temperature dependence constant (K)
k°H (mol/(kg*bar)) | d(ln(kH))/d(1/T) (K) | Method | Reference |
---|---|---|---|
50. | 4900. | M | Becker, Kleffmann, et al., 1996 |
49. | 4900. | M | N/A |
49. | 4800. | T | N/A |
48. | 4700. | T | N/A |
37. | C | N/A | |
49. | 4800. | L | N/A |

Gas phase ion energetics data

Data compiled as indicated in comments:
B - John E. Bartmess
LL - Sharon G. Lias and Joel F. Liebman
Ionization energy determinations
IE (eV) | Method | Reference | Comment |
---|---|---|---|
≤11.3 | DER | Lias, Bartmess, et al., 1988 | LL |
De-protonation reactions
Quantity | Value | Units | Method | Reference | Comment |
---|---|---|---|---|---|
ΔrH° | 1423.5 ± 0.88 | kJ/mol | D-EA | Ervin, Ho, et al., 1988 | gas phase; B |
Quantity | Value | Units | Method | Reference | Comment |
ΔrG° | 1396.3 ± 1.3 | kJ/mol | H-TS | Ervin, Ho, et al., 1988 | gas phase; B |

Ion clustering data

Data compiled by: John E. Bartmess
Clustering reactions
By formula: NO2- + HNO2 = (NO2- • HNO2)
Quantity | Value | Units | Method | Reference | Comment |
---|---|---|---|---|---|
ΔrH° | 136. ± 4.2 | kJ/mol | TDAs | Lee, Keesee, et al., 1980 | gas phase |

References

Chase, 1998
Chase, M.W., Jr.,
NIST-JANAF Themochemical Tables, Fourth Edition,
J. Phys. Chem. Ref. Data, Monograph 9, 1998, 1-1951. [all data]
Ervin, Ho, et al., 1988
Ervin, K.M.; Ho, J.; Lineberger, W.C.,
Ultraviolet Photoelectron Spectrum of NO2-,
J. Phys. Chem., 1988, 92, 19, 5405, https://doi.org/10.1021/j100330a017
. [all data]
Lee, Keesee, et al., 1980
Lee, N.; Keesee, R.G.; Castleman, A.W., Jr.,
The properties of clusters in the gas phase. IV. Complexes of H2O and HNOx clustering on NOx-,
J. Chem. Phys., 1980, 72, 1089. [all data]
Swientoslawski, 1910
Swientoslawski, W.,
Thermochemische Untersuchungen der organischen Verbindungen. Dritte Mitteilung. Stickstoffhaltige Verbindungen.,
Z. Phys. Chem., 1910, 72, 49-83. [all data]
Becker, Kleffmann, et al., 1996
Becker, K.H.; Kleffmann, J.; Kurtenbach, R.; Wiesen, P.,
Solubility of Nitrous Acid (HONO) in Sulfuric Acid Solutions,
J. Phys. Chem., 1996, 100, 14984-14990. [all data]
Lias, Bartmess, et al., 1988
Lias, S.G.; Bartmess, J.E.; Liebman, J.F.; Holmes, J.L.; Levin, R.D.; Mallard, W.G.,
Gas-phase ion and neutral thermochemistry,
J. Phys. Chem. Ref. Data, Suppl. 1, 1988, 17, 1-861. [all data]