Dimethyl diphenylsilane
- Formula: C14H16Si
- Molecular weight: 212.3623
- IUPAC Standard InChIKey: WJKVFIFBAASZJX-UHFFFAOYSA-N
- CAS Registry Number: 778-24-5
- Chemical structure:
View 3d structure (requires JavaScript / HTML 5) - Other names: Diphenyldimethylsilane; Silane, dimethyldiphenyl-

Gas phase ion energetics data

Data compiled as indicated in comments:
LLK - Sharon G. Lias, Rhoda D. Levin, and Sherif A. Kafafi
Ionization energy determinations
IE (eV) | Method | Reference | Comment |
---|---|---|---|
8.5 | PE | Traven', Redchenko, et al., 1981 | LLK |
8.98 | PE | Traven', Redchenko, et al., 1981 | Vertical value; LLK |

References

Traven', Redchenko, et al., 1981
Traven', V.F.; Redchenko, V.V.; Eismont, M.Y.; Stepanov, B.I.,
Photoelectron spectra and electronic and steric structures of silicon and sulfur-containing analogs of 9,10-dihydroanthracene,
J. Gen. Chem. USSR, 1981, 51, 1099, In original 1297. [all data]