potassium perchlorate
- Formula: ClKO4
- Molecular weight: 138.549
- IUPAC Standard InChIKey: YLMGFJXSLBMXHK-UHFFFAOYSA-M
- CAS Registry Number: 7778-74-7
- Chemical structure:
View 3d structure (requires JavaScript / HTML 5) - Species with the same structure:

Condensed phase thermochemistry data

Quantity | Value | Units | Method | Reference | Comment |
---|---|---|---|---|---|
ΔfH°solid | -430.12 | kJ/mol | Review | Chase, 1998 | Data last reviewed in June, 1963 |
Quantity | Value | Units | Method | Reference | Comment |
S°solid | 150.86 | J/mol*K | Review | Chase, 1998 | Data last reviewed in June, 1963 |
Solid Phase Heat Capacity (Shomate Equation)
Cp° = A + B*t + C*t2 + D*t3 +
E/t2
H° − H°298.15= A*t + B*t2/2 +
C*t3/3 + D*t4/4 − E/t + F − H
S° = A*ln(t) + B*t + C*t2/2 + D*t3/3 −
E/(2*t2) + G
Cp = heat capacity (J/mol*K)
H° = standard enthalpy (kJ/mol)
S° = standard entropy (J/mol*K)
t = temperature (K) / 1000.
View plot Requires a JavaScript / HTML 5 canvas capable browser.
Temperature (K) | 298. to 573. | 573. to 1500. |
---|---|---|
A | 1327.170 | 81.12610 |
B | -5465.190 | 193.6900 |
C | 9452.530 | -101.9070 |
D | -5641.080 | 22.93190 |
E | -24.66150 | -0.129797 |
F | -738.0270 | -449.9950 |
G | 2877.380 | 215.5180 |
H | -430.1150 | -430.1150 |
Reference | Chase, 1998 | Chase, 1998 |
Comment | Data last reviewed in June, 1963 | Data last reviewed in June, 1963 |

Gas phase ion energetics data

Data compiled by: Sharon G. Lias, Rhoda D. Levin, and Sherif A. Kafafi
Appearance energy determinations
Ion | AE (eV) | Other Products | Method | Reference | Comment |
---|---|---|---|---|---|
K+ | 10.7 ± 0.4 | ? | EI | Nikolaev, Ovchinnikov, et al., 1980 |

References

Chase, 1998
Chase, M.W., Jr.,
NIST-JANAF Themochemical Tables, Fourth Edition,
J. Phys. Chem. Ref. Data, Monograph 9, 1998, 1-1951. [all data]
Nikolaev, Ovchinnikov, et al., 1980
Nikolaev, E.N.; Ovchinnikov, K.V.; Semenov, G.A.,
Mass-spectrometric study of the composition of the vapor above alkali-metal perchlorates,
J. Gen. Chem. USSR, 1980, 51, 1460. [all data]