1-Pentyn-3-ol, 3-methyl-
- Formula: C6H10O
- Molecular weight: 98.1430
- IUPAC Standard InChIKey: QXLPXWSKPNOQLE-UHFFFAOYSA-N
- CAS Registry Number: 77-75-8
- Chemical structure:
View 3d structure (requires JavaScript / HTML 5) - Other names: Meparfynol; α-Ethyl-α-methylpropargyl alcohol; Allotropal; Apridol; Atempol; Citodorm; Dormidin; Dormigen; Dormiphen; Dormison; Dormosan; Formison; Hexofen; Imnudorm; Melpintol; Methylparafynol; Oblivon; Pentadorm; Pentinol; Pentydorm; Perlopal; Riposon; Sedapercut; Seral; Somnesin; 2-Butanol, 2-ethynyl-; 2-Ethynyl-2-butanol; 3-Methyl-1-pentyn-3-ol; 3-Methyl-1-pentin-3-ol; anti-Stress; Aniphor; Atemorin; BDH; Comesa; Dalgol; Dorison; Dormalest; Dormocit; Ethinylmethylethylcarbinol; Hesofen; Insomnol; Macarol; Mecarol; Mepentamato; Mepentil; Methylethylacetylenylcarbinol; Methylethylethynylcarbinol; Methylpentynolum; Metilparafinolo; Metilpentinolo; Miramel; N-Oblivon; Noxokratin; Oblevil; Oblivon C; Olosot; Olvadon; Pentydrom; Pentyrest; Placidal; Sintyal; Sonnormon; Trusono; Util; 2-Ethinyl butanol-2; 3-Methylpent-1-yn-3-ol; 3-Methylpentyn-3-ol; Ethyl ethynyl methyl carbinol; Methylpentinol; 3-Methyl-pentin-(1)-ol-(3); 3-Methylpentin-3-ol; Methylpentynol; 3-Metil-pentin-3-ol; Pent-1-yne-3-ol, 3-methyl-; (+/-)-3-Methylpent-1-yn-3-ol; 3-Methyl-1-pentyne-3-ol; 3-Hydroxy-3-methyl-1-pentyne; Ethynylethylmethylcarbinol; Olfine P

Phase change data

Data compiled by: Robert L. Brown and Stephen E. Stein
Quantity | Value | Units | Method | Reference | Comment |
---|---|---|---|---|---|
Tboil | 394. to 395. | K | N/A | Farchan Laboratories, 1990 | |
Tboil | 393.7 | K | N/A | Weast and Grasselli, 1989 |

Gas phase ion energetics data

Data compiled by: Sharon G. Lias, Rhoda D. Levin, and Sherif A. Kafafi
Ionization energy determinations
IE (eV) | Method | Reference | Comment |
---|---|---|---|
10.03 | PE | Andreocci, Bitchev, et al., 1979 | Vertical value |

Kovats' RI, non-polar column, isothermal

Column type | Active phase | Temperature (C) | I | Reference | Comment |
---|---|---|---|---|---|
Packed | OV-1 | 120. | 690. | Valko, Papp, et al., 1984 | Gas Chrom Q; Column length: 2. m |
Packed | Apiezon L | 120. | 660. | Bogoslovsky, Anvaer, et al., 1978 | Celite 545 |
Packed | Apiezon L | 160. | 663. | Bogoslovsky, Anvaer, et al., 1978 | Celite 545 |

Normal alkane RI, non-polar column, custom temperature program

Column type | Active phase | I | Reference | Comment |
---|---|---|---|---|
Capillary | SPB-1 | 695. | Flanagan, Streete, et al., 1997 | 60. m/0.53 mm/5. μm, He; Program: 40C(6min) => 5C/min => 80C => 10C/min => 200C |
Capillary | SPB-1 | 695. | Strete, Ruprah, et al., 1992 | 60. m/0.53 mm/5.0 μm, Helium; Program: 40 0C (6 min) 5 0C/min -> 80 0C 10 0C/min -> 200 0C |
Capillary | SPB-1 | 715. | Strete, Ruprah, et al., 1992 | 60. m/0.53 mm/5.0 μm, Helium; Program: not specified |
Capillary | OV-1 | 715. | Ramsey and Flanagan, 1982 | Program: not specified |

Normal alkane RI, polar column, custom temperature program

Column type | Active phase | I | Reference | Comment |
---|---|---|---|---|
Capillary | Carbowax 20M | 1275. | Ramsey and Flanagan, 1982 | Program: not specified |

References

Farchan Laboratories, 1990
Farchan Laboratories,
Research Chemicals Catalog, Farchan Laboratories, Gainesville, FL, 1990, 91. [all data]
Weast and Grasselli, 1989
CRC Handbook of Data on Organic Compounds, 2nd Editon, Weast,R.C and Grasselli, J.G., ed(s)., CRC Press, Inc., Boca Raton, FL, 1989, 1. [all data]
Andreocci, Bitchev, et al., 1979
Andreocci, M.V.; Bitchev, P.; Carusi, P.; Furlani, A.,
Valence shell photoionization spectra of some substituted hydroxy-acetylenes. A tentative correlation with their cyclotrimerization reactions,
J. Electron Spectrosc. Relat. Phenom., 1979, 16, 25. [all data]
Valko, Papp, et al., 1984
Valko, K.; Papp, O.; Darvas, F.,
Selection of Gas Chromatographic Stationary Phase Pairs for Characterization of the 1-Octanol-Water Partition Coefficient,
J. Chromatogr., 1984, 301, 355-364, https://doi.org/10.1016/S0021-9673(01)89210-4
. [all data]
Bogoslovsky, Anvaer, et al., 1978
Bogoslovsky, Yu.N.; Anvaer, B.I.; Vigdergauz, M.S.,
Chromatographic constants in gas chromatography (in Russian), Standards Publ. House, Moscow, 1978, 192. [all data]
Flanagan, Streete, et al., 1997
Flanagan, R.J.; Streete, P.J.; Ramsey, J.D.,
Volatile Substance Abuse, UNODC Technical Series, No 5, United Nations, Office on Drugs and Crime, Vienna International Centre, PO Box 500, A-1400 Vienna, Austria, 1997, 56, retrieved from http://www.odccp.org/pdf/technicalseries1997-01-011.pdf. [all data]
Strete, Ruprah, et al., 1992
Strete, P.J.; Ruprah, M.; Ramsey, J.D.; Flanagan, R.J.,
Detection and identification of volatile substances by headspace capillary gas chromatography to aid the diagnosis of acute poisoning,
Analyst, 1992, 117, 7, 1111-1127, https://doi.org/10.1039/an9921701111
. [all data]
Ramsey and Flanagan, 1982
Ramsey, J.D.; Flanagan, R.J.,
Detection and Identification of Volatile Organic Compounds in Blood by Headspace Gas Chromatography as an Aid to the Diagnosis of Solvent Abuse,
J. Chromatogr., 1982, 240, 2, 423-444, https://doi.org/10.1016/S0021-9673(00)99622-5
. [all data]