sodium metaborate, anhydrous
- Formula: BNaO2
- Molecular weight: 65.800
- CAS Registry Number: 7775-19-1

Condensed phase thermochemistry data

Quantity | Value | Units | Method | Reference | Comment |
---|---|---|---|---|---|
ΔfH°liquid | -229.45 | kcal/mol | Review | Chase, 1998 | Data last reviewed in June, 1971 |
Quantity | Value | Units | Method | Reference | Comment |
S°liquid,1 bar | 19.83 | cal/mol*K | Review | Chase, 1998 | Data last reviewed in June, 1971 |
Quantity | Value | Units | Method | Reference | Comment |
ΔfH°solid | -233.20 | kcal/mol | Review | Chase, 1998 | Data last reviewed in June, 1971 |
Quantity | Value | Units | Method | Reference | Comment |
S°solid | 17.57 | cal/mol*K | Review | Chase, 1998 | Data last reviewed in June, 1971 |
Liquid Phase Heat Capacity (Shomate Equation)
Cp° = A + B*t + C*t2 + D*t3 +
E/t2
H° − H°298.15= A*t + B*t2/2 +
C*t3/3 + D*t4/4 − E/t + F − H
S° = A*ln(t) + B*t + C*t2/2 + D*t3/3 −
E/(2*t2) + G
Cp = heat capacity (cal/mol*K)
H° = standard enthalpy (kcal/mol)
S° = standard entropy (cal/mol*K)
t = temperature (K) / 1000.
View plot Requires a JavaScript / HTML 5 canvas capable browser.
Temperature (K) | 1240. to 2500. |
---|---|
A | 35.00000 |
B | -5.833330×10-8 |
C | 2.846210×10-8 |
D | -4.722101×10-9 |
E | -7.848880×10-9 |
F | -247.6329 |
G | 46.56401 |
H | -229.4500 |
Reference | Chase, 1998 |
Comment | Data last reviewed in June, 1971 |
Solid Phase Heat Capacity (Shomate Equation)
Cp° = A + B*t + C*t2 + D*t3 +
E/t2
H° − H°298.15= A*t + B*t2/2 +
C*t3/3 + D*t4/4 − E/t + F − H
S° = A*ln(t) + B*t + C*t2/2 + D*t3/3 −
E/(2*t2) + G
Cp = heat capacity (cal/mol*K)
H° = standard enthalpy (kcal/mol)
S° = standard entropy (cal/mol*K)
t = temperature (K) / 1000.
View plot Requires a JavaScript / HTML 5 canvas capable browser.
Temperature (K) | 298. to 1240. |
---|---|
A | 9.576090 |
B | 28.78850 |
C | -17.30300 |
D | 3.642689 |
E | -0.085099 |
F | -237.4750 |
G | 20.83560 |
H | -233.2000 |
Reference | Chase, 1998 |
Comment | Data last reviewed in June, 1971 |

Gas phase ion energetics data

Data compiled by: Sharon G. Lias, Rhoda D. Levin, and Sherif A. Kafafi
Ionization energy determinations
IE (eV) | Method | Reference |
---|---|---|
9.18 ± 0.10 | EI | Shevchenko, Iljin, et al., 1976 |
Appearance energy determinations
Ion | AE (eV) | Other Products | Method | Reference | Comment |
---|---|---|---|---|---|
Na+ | 9.66 ± 0.15 | BO2 | EI | Shevchenko, Iljin, et al., 1976 |

Gas phase thermochemistry data

Quantity Value Units Method Reference Comment
Δfgas-155.00kcal/molReviewChase, 1998Data last reviewed in June, 1971
Quantity Value Units Method Reference Comment
gas,1 bar68.654cal/mol*KReviewChase, 1998Data last reviewed in June, 1971

Gas Phase Heat Capacity (Shomate Equation)

Cp° = A + B*t + C*t2 + D*t3 + E/t2
H° − H°298.15= A*t + B*t2/2 + C*t3/3 + D*t4/4 − E/t + F − H
S° = A*ln(t) + B*t + C*t2/2 + D*t3/3 − E/(2*t2) + G
    Cp = heat capacity (cal/mol*K)
    H° = standard enthalpy (kcal/mol)
    S° = standard entropy (cal/mol*K)
    t = temperature (K) / 1000.

View plot Requires a JavaScript / HTML 5 canvas capable browser.

View table.

Temperature (K) 2500. - 6000.
A 19.43940
B 0.231220
C -0.045253
D 0.003054
E -1.361360
F -164.1410
G 87.51350
H -155.0000
ReferenceChase, 1998
Comment Data last reviewed in June, 1971

References

Chase, 1998
Chase, M.W., Jr.,
NIST-JANAF Themochemical Tables, Fourth Edition,
J. Phys. Chem. Ref. Data, Monograph 9, 1998, 1-1951. [all data]
Shevchenko, Iljin, et al., 1976
Shevchenko, V.E.; Iljin, M.K.; Nikitin, O.T.; Sidorov, L.N.,
Mass-spectrometric study of mixed dimers M2BO2F,
Int. J. Mass Spectrom. Ion Phys., 1976, 21, 279. [all data]