Dicyclopentadiene
- Formula: C10H12
- Molecular weight: 132.2023
- IUPAC Standard InChIKey: HECLRDQVFMWTQS-BMNUFHGDSA-N
- CAS Registry Number: 77-73-6
- Chemical structure:
View 3d structure (requires JavaScript / HTML 5) - Stereoisomers:
- Other names: 4,7-Methano-1H-indene, 3a,4,7,7a-tetrahydro-; 4,7-Methanoindene, 3a,4,7,7a-tetrahydro-; Bicyclopentadiene; Bis[cyclopentadiene]; Cyclopentadiene dimer; 3a,4,7,7a-Tetrahydro-4,7-methanoindene; 3a,4,7,7a-Tetrahydro-4,7-methano-1H-indene; Tricyclo[5.2.1.02,6]deca-3,8-diene; 1,3-Cyclopentadiene, dimer; Dicyklopentadien; Dimer cyklopentadienu; UN 2048; NSC 7352; Tricyclo[5.2.1.0<2,6>]deca-3,8-diene

Phase change data

Data compiled as indicated in comments:
BS - Robert L. Brown and Stephen E. Stein
TRC - Thermodynamics Research Center, NIST Boulder Laboratories, Chris Muzny director
AC - William E. Acree, Jr., James S. Chickos
Quantity | Value | Units | Method | Reference | Comment |
---|---|---|---|---|---|
Tboil | 443.2 | K | N/A | Aldrich Chemical Company Inc., 1990 | BS |
Tboil | 359.2 | K | N/A | Kistiakowsky, Ruhoff, et al., 1936 | Uncertainty assigned by TRC = 50. K; this value inconsistent with other reported values; TRC |
Quantity | Value | Units | Method | Reference | Comment |
Tfus | 306.8 | K | N/A | Kistiakowsky, Ruhoff, et al., 1936 | Uncertainty assigned by TRC = 0.5 K; Note: the boiling point reported for this compound was incorrect; TRC |
Tfus | 305. | K | N/A | Stobbe and Reuss, 1912 | Uncertainty assigned by TRC = 4. K; TRC |
Quantity | Value | Units | Method | Reference | Comment |
Ttriple | 304.8 | K | N/A | Lebedev and Lityagov, 1977 | Crystal phase 1 phase; Uncertainty assigned by TRC = 0.2 K; TRC |
Enthalpy of vaporization
ΔvapH (kJ/mol) | Temperature (K) | Reference | Comment |
---|---|---|---|
42.4 | 322. | Stull, 1947 | Based on data from 307. to 440. K.; AC |

Reaction thermochemistry data

Data compiled by: Hussein Y. Afeefy, Joel F. Liebman, and Stephen E. Stein
Individual Reactions
By formula: C10H12 = 2C5H6
Quantity | Value | Units | Method | Reference | Comment |
---|---|---|---|---|---|
ΔrH° | 72.383 | kJ/mol | Cm | Baur and Frater, 1941 | gas phase; Heat of dissociation |

Gas phase ion energetics data

Data compiled by: Henry M. Rosenstock, Keith Draxl, Bruce W. Steiner, and John T. Herron
Ionization energy determinations
IE (eV) | Method | Reference |
---|---|---|
8.79 ± 0.05 | PE | Baker, Betteridge, et al., 1970 |

Kovats' RI, non-polar column, isothermal

Column type | Active phase | Temperature (C) | I | Reference | Comment |
---|---|---|---|---|---|
Capillary | Squalane | 106. | 1007. | Kugucheva and Mashinsky, 1983 | He; Column length: 100. m |
Capillary | Squalane | 96. | 1002. | Kugucheva and Mashinsky, 1983 | He; Column length: 100. m |
Capillary | SE-30 | 130. | 1043. | Bredael, 1982 | Column length: 100. m; Column diameter: 0.5 mm |
Capillary | SE-30 | 80. | 1014. | Bredael, 1982 | Column length: 100. m; Column diameter: 0.5 mm |
Capillary | OV-101 | 140. | 1047.3 | Gerasimenko, Kirilenko, et al., 1981 | N2; Column length: 50. m; Column diameter: 0.3 mm |
Capillary | Squalane | 86. | 993.3 | Nabivach, Bur'yan, et al., 1978 | Column length: 50. m; Column diameter: 0.25 mm |
Capillary | Squalane | 96. | 1004.3 | Nabivach, Bur'yan, et al., 1978 | Column length: 50. m; Column diameter: 0.25 mm |

Van Den Dool and Kratz RI, non-polar column, temperature ramp

Column type | Active phase | I | Reference | Comment |
---|---|---|---|---|
Capillary | Petrocol DH | 1014. | White, Hackett, et al., 1992 | 100. m/0.25 mm/0.5 μm, He, 1. K/min; Tstart: 30. C; Tend: 220. C |

Normal alkane RI, non-polar column, temperature ramp

Column type | Active phase | I | Reference | Comment |
---|---|---|---|---|
Capillary | Petrocol DH | 1018. | Supelco, 2012 | 100. m/0.25 mm/0.50 μm, Helium, 20. C @ 15. min, 15. K/min, 220. C @ 30. min |

Normal alkane RI, non-polar column, custom temperature program

Column type | Active phase | I | Reference | Comment |
---|---|---|---|---|
Capillary | Squalane | 1000. | Chen, 2008 | Program: not specified |
Capillary | Squalane | 1014. | Chen, 2008 | Program: not specified |
Capillary | OV-101 | 1011. | Zenkevich, 1998 | He; Column length: 25. m; Column diameter: 0.20 mm; Program: not specified |
Capillary | OV-101 | 1018. | Zenkevich, 1998 | He; Column length: 25. m; Column diameter: 0.20 mm; Program: not specified |

References

Aldrich Chemical Company Inc., 1990
Aldrich Chemical Company Inc.,
Catalog Handbook of Fine Chemicals, Aldrich Chemical Company, Inc., Milwaukee WI, 1990, 1. [all data]
Kistiakowsky, Ruhoff, et al., 1936
Kistiakowsky, G.B.; Ruhoff, J.R.; Smith, H.A.; Vaughan, W.E.,
Heats of Organic Reactions IV. Hydrogenation of Some Dienes and of Benzene,
J. Am. Chem. Soc., 1936, 58, 146-53. [all data]
Stobbe and Reuss, 1912
Stobbe, H.; Reuss, F.,
Polymerization of Cyclopentadienes,
Justus Liebigs Ann. Chem., 1912, 391, 151. [all data]
Lebedev and Lityagov, 1977
Lebedev, B.V.; Lityagov, V.Ya.,
Thermodynamics of polypentenamer synthesis reactions crystalline polytetrahydrofuran at 0 K,
Vysokomol. Soedin., Ser. B, 1977, 19, 558. [all data]
Stull, 1947
Stull, Daniel R.,
Vapor Pressure of Pure Substances. Organic and Inorganic Compounds,
Ind. Eng. Chem., 1947, 39, 4, 517-540, https://doi.org/10.1021/ie50448a022
. [all data]
Baur and Frater, 1941
Baur, E.; Frater, S.,
Kinetik der bildung und des zerfalls von dicyclopentadien,
Helv. Chim. Acta, 1941, 24, 768-783. [all data]
Baker, Betteridge, et al., 1970
Baker, A.D.; Betteridge, D.; Kemp, N.R.; Kirby, R.E.,
Application of photoelectron spectrometry to pesticide analysis. Photoelectron spectra of fivemembered heterocycles and related molecules,
Anal. Chem., 1970, 42, 1064. [all data]