1-Naphthalenamine, 4-nitro-
- Formula: C10H8N2O2
- Molecular weight: 188.1827
- IUPAC Standard InChIKey: BVPJPRYNQHAOPQ-UHFFFAOYSA-N
- CAS Registry Number: 776-34-1
- Chemical structure:
View 3d structure (requires JavaScript / HTML 5) - Other names: 4-Nitro-α-naphthylamine; 1-Naphthylamine, 4-nitro-; 1-Amino-4-nitronaphthalene; 1,4-Nitronaphthylamine; 4-Nitro-1-naphthamine; 4-Nitro-1-naphthylamine; 4-Nitro-1-naphthalenamine; NSC 614; Naphthalene, 1-amino-4-nitro

Gas phase ion energetics data

Data compiled by: Sharon G. Lias, Rhoda D. Levin, and Sherif A. Kafafi
Ionization energy determinations
IE (eV) | Method | Reference |
---|---|---|
7.73 ± 0.02 | PI | Potapov, Kardash, et al., 1972 |

Lee's RI, non-polar column, custom temperature program

Column type | Active phase | I | Reference | Comment |
---|---|---|---|---|
Capillary | OV-101 | 368.6 | Tucminen, Wickstrom, et al., 1986 | Program: not specified |

References

Potapov, Kardash, et al., 1972
Potapov, V.K.; Kardash, I.E.; Sorokin, V.V.; Sokolov, S.A.; Evlasheva, T.I.,
Photoionization of heteroaromatic compounds,
Khim. Vys. Energ., 1972, 6, 392. [all data]
Milliaresi and Ruchkina, 1970
Milliaresi, E.E.; Ruchkina, N.G.,
Doklady Akad. Nauk S.S.S.R., 1970, 190, 600. [all data]
Tucminen, Wickstrom, et al., 1986
Tucminen, A.; Wickstrom, K.; Pyysalo, H.,
Determination of Polycyclic Aromatic Compounds by GLC-Selected Ion Monitoring (SIM) Technique,
J. Hi. Res. Chromatogr. Chromatogr. Comm., 1986, 9, 8, 469-471, https://doi.org/10.1002/jhrc.1240090813
. [all data]