iron dichloride
- Formula: Cl2Fe
- Molecular weight: 126.751
- CAS Registry Number: 7758-94-3

Gas phase thermochemistry data

Quantity | Value | Units | Method | Reference | Comment |
---|---|---|---|---|---|
ΔfH°gas | -141.00 | kJ/mol | Review | Chase, 1998 | Data last reviewed in December, 1970 |
Quantity | Value | Units | Method | Reference | Comment |
S°gas,1 bar | 299.38 | J/mol*K | Review | Chase, 1998 | Data last reviewed in December, 1970 |
Gas Phase Heat Capacity (Shomate Equation)
Cp° = A + B*t + C*t2 + D*t3 +
E/t2
H° − H°298.15= A*t + B*t2/2 +
C*t3/3 + D*t4/4 − E/t + F − H
S° = A*ln(t) + B*t + C*t2/2 + D*t3/3 −
E/(2*t2) + G
Cp = heat capacity (J/mol*K)
H° = standard enthalpy (kJ/mol)
S° = standard entropy (J/mol*K)
t = temperature (K) / 1000.
View plot Requires a JavaScript / HTML 5 canvas capable browser.
Temperature (K) | 2000. to 6000. |
---|---|
A | 57.16808 |
B | 7.150958 |
C | -1.624811 |
D | 0.108746 |
E | -0.110161 |
F | -158.7175 |
G | 365.8849 |
H | -141.0012 |
Reference | Chase, 1998 |
Comment | Data last reviewed in December, 1970 |

Condensed phase thermochemistry data

Quantity | Value | Units | Method | Reference | Comment |
---|---|---|---|---|---|
ΔfH°liquid | -311.34 | kJ/mol | Review | Chase, 1998 | Data last reviewed in December, 1970 |
Quantity | Value | Units | Method | Reference | Comment |
S°liquid,1 bar | 139.88 | J/mol*K | Review | Chase, 1998 | Data last reviewed in December, 1970 |
Quantity | Value | Units | Method | Reference | Comment |
ΔfH°solid | -341.83 | kJ/mol | Review | Chase, 1998 | Data last reviewed in December, 1970 |
Quantity | Value | Units | Method | Reference | Comment |
S°solid | 117.95 | J/mol*K | Review | Chase, 1998 | Data last reviewed in December, 1970 |
Liquid Phase Heat Capacity (Shomate Equation)
Cp° = A + B*t + C*t2 + D*t3 +
E/t2
H° − H°298.15= A*t + B*t2/2 +
C*t3/3 + D*t4/4 − E/t + F − H
S° = A*ln(t) + B*t + C*t2/2 + D*t3/3 −
E/(2*t2) + G
Cp = heat capacity (J/mol*K)
H° = standard enthalpy (kJ/mol)
S° = standard entropy (J/mol*K)
t = temperature (K) / 1000.
View plot Requires a JavaScript / HTML 5 canvas capable browser.
Temperature (K) | 950. to 2000. |
---|---|
A | 102.1733 |
B | -1.078819×10-8 |
C | 8.424401×10-9 |
D | -2.096737×10-9 |
E | -1.846362×10-10 |
F | -341.7989 |
G | 263.5225 |
H | -311.3365 |
Reference | Chase, 1998 |
Comment | Data last reviewed in December, 1970 |
Solid Phase Heat Capacity (Shomate Equation)
Cp° = A + B*t + C*t2 + D*t3 +
E/t2
H° − H°298.15= A*t + B*t2/2 +
C*t3/3 + D*t4/4 − E/t + F − H
S° = A*ln(t) + B*t + C*t2/2 + D*t3/3 −
E/(2*t2) + G
Cp = heat capacity (J/mol*K)
H° = standard enthalpy (kJ/mol)
S° = standard entropy (J/mol*K)
t = temperature (K) / 1000.
View plot Requires a JavaScript / HTML 5 canvas capable browser.
Temperature (K) | 298. to 950. |
---|---|
A | 73.66852 |
B | 22.54009 |
C | -10.12172 |
D | 1.466200 |
E | -0.252648 |
F | -365.5636 |
G | 199.3923 |
H | -341.8332 |
Reference | Chase, 1998 |
Comment | Data last reviewed in December, 1970 |

Phase change data

Data compiled by: William E. Acree, Jr., James S. Chickos
Quantity | Value | Units | Method | Reference | Comment |
---|---|---|---|---|---|
ΔsubH° | 204. ± 4.0 | kJ/mol | N/A | Bardi, Brunetti, et al., 1996 | |
ΔsubH° | 193. ± 12. | kJ/mol | N/A | Schoonmaker and Porter, 1958 | See also Bardi, Brunetti, et al., 1996. |
Enthalpy of sublimation
ΔsubH (kJ/mol) | Temperature (K) | Method | Reference | Comment |
---|---|---|---|---|
198.9 ± 2.0 | 780. | TE,ME | Bardi, Brunetti, et al., 1996 | Based on data from 693. to 866. K. |
189. ± 8. | 719. | TE | Sime and Gregory, 1960 | Based on data from 694. to 745. K. See also Bardi, Brunetti, et al., 1996. |
186. ± 12. | 640. | MS | Schoonmaker and Porter, 1958 | Based on data from 621. to 658. K. See also Bardi, Brunetti, et al., 1996. |

Gas phase ion energetics data

Data compiled as indicated in comments:
LLK - Sharon G. Lias, Rhoda D. Levin, and Sherif A. Kafafi
RDSH - Henry M. Rosenstock, Keith Draxl, Bruce W. Steiner, and John T. Herron
Ionization energy determinations
IE (eV) | Method | Reference | Comment |
---|---|---|---|
10.0 | PE | Lee, Potts, et al., 1980 | LLK |
11.5 ± 0.5 | EI | Schoonmaker and Porter, 1958 | RDSH |
10.1 | PE | MacNaughton, Bloor, et al., 1981 | Vertical value; LLK |
10.34 | PE | Lee, Potts, et al., 1980 | Vertical value; LLK |
Appearance energy determinations
Ion | AE (eV) | Other Products | Method | Reference | Comment |
---|---|---|---|---|---|
FeCl+ | 12.8 ± 0.5 | Cl | EI | Schoonmaker and Porter, 1958 | RDSH |
Fe+ | 16.5 ± 0.5 | ? | EI | Schoonmaker and Porter, 1958 | RDSH |

References

Chase, 1998
Chase, M.W., Jr.,
NIST-JANAF Themochemical Tables, Fourth Edition,
J. Phys. Chem. Ref. Data, Monograph 9, 1998, 1-1951. [all data]
Bardi, Brunetti, et al., 1996
Bardi, Gianpiero; Brunetti, Bruno; Piacente, Vincenzo,
Vapor Pressure and Standard Enthalpies of Sublimation of Iron Difluoride, Iron Dichloride, and Iron Dibromide,
J. Chem. Eng. Data, 1996, 41, 1, 14-20, https://doi.org/10.1021/je950115w
. [all data]
Schoonmaker and Porter, 1958
Schoonmaker, R.C.; Porter, R.F.,
Mass spectrometric study of ferrous chloride vapor,
J. Chem. Phys., 1958, 29, 116. [all data]
Sime and Gregory, 1960
Sime, R.J.; Gregory, N.W.,
VAPOR PRESSURES OF FeCl 2 , FeBr 2 AND FeI 2 BY THE TORSION EFFUSION METHOD,
J. Phys. Chem., 1960, 64, 1, 86-89, https://doi.org/10.1021/j100830a021
. [all data]
Lee, Potts, et al., 1980
Lee, E.P.F.; Potts, A.W.; Doran, M.; Hillier, I.H.; Delaney, J.J.; Hawksworth, R.W.; Guest, M.F.,
Photoelectron spectra and electronic structure of the transition metal dichlorides, MCl2(M = Cr, Mn, Fe, Co, Ni),
J. Chem. Soc. Faraday Trans. 2, 1980, 76, 506. [all data]
MacNaughton, Bloor, et al., 1981
MacNaughton, R.M.; Bloor, J.E.; Sherrod, R.E.; Schweitzer, G.K.,
The He(I) photoelectron psectra of some gaseous 3d-transition metal dihalides,
J. Electron Spectrosc. Relat. Phenom., 1981, 22, 1. [all data]