copper chloride
- Formula: ClCu
- Molecular weight: 98.999
- IUPAC Standard InChIKey: OXBLHERUFWYNTN-UHFFFAOYSA-M
- CAS Registry Number: 7758-89-6
- Chemical structure:
View 3d structure (requires JavaScript / HTML 5) - Other names: Cuprous monochloride

Condensed phase thermochemistry data

Quantity | Value | Units | Method | Reference | Comment |
---|---|---|---|---|---|
ΔfH°liquid | -131.18 | kJ/mol | Review | Chase, 1998 | Data last reviewed in March, 1966 |
Quantity | Value | Units | Method | Reference | Comment |
S°liquid,1 bar | 93.75 | J/mol*K | Review | Chase, 1998 | Data last reviewed in March, 1966 |
Quantity | Value | Units | Method | Reference | Comment |
ΔfH°solid | -138.07 | kJ/mol | Review | Chase, 1998 | Data last reviewed in March, 1966 |
Quantity | Value | Units | Method | Reference | Comment |
S°solid | 87.04 | J/mol*K | Review | Chase, 1998 | Data last reviewed in March, 1966 |
Liquid Phase Heat Capacity (Shomate Equation)
Cp° = A + B*t + C*t2 + D*t3 +
E/t2
H° − H°298.15= A*t + B*t2/2 +
C*t3/3 + D*t4/4 − E/t + F − H
S° = A*ln(t) + B*t + C*t2/2 + D*t3/3 −
E/(2*t2) + G
Cp = heat capacity (J/mol*K)
H° = standard enthalpy (kJ/mol)
S° = standard entropy (J/mol*K)
t = temperature (K) / 1000.
View plot Requires a JavaScript / HTML 5 canvas capable browser.
Temperature (K) | 703. to 3000. |
---|---|
A | 66.94400 |
B | -3.699628×10-10 |
C | 2.166748×10-10 |
D | -3.900460×10-11 |
E | -9.813196×10-12 |
F | -151.1374 |
G | 174.7653 |
H | -131.1780 |
Reference | Chase, 1998 |
Comment | Data last reviewed in March, 1966 |
Solid Phase Heat Capacity (Shomate Equation)
Cp° = A + B*t + C*t2 + D*t3 +
E/t2
H° − H°298.15= A*t + B*t2/2 +
C*t3/3 + D*t4/4 − E/t + F − H
S° = A*ln(t) + B*t + C*t2/2 + D*t3/3 −
E/(2*t2) + G
Cp = heat capacity (J/mol*K)
H° = standard enthalpy (kJ/mol)
S° = standard entropy (J/mol*K)
t = temperature (K) / 1000.
View plot Requires a JavaScript / HTML 5 canvas capable browser.
Temperature (K) | 298. to 703. |
---|---|
A | 75.27100 |
B | -26.83212 |
C | 25.69156 |
D | -7.357982 |
E | -1.847747 |
F | -165.7299 |
G | 174.6644 |
H | -138.0720 |
Reference | Chase, 1998 |
Comment | Data last reviewed in March, 1966 |

Gas phase ion energetics data

Data compiled as indicated in comments:
LLK - Sharon G. Lias, Rhoda D. Levin, and Sherif A. Kafafi
RDSH - Henry M. Rosenstock, Keith Draxl, Bruce W. Steiner, and John T. Herron
Ionization energy determinations
IE (eV) | Method | Reference | Comment |
---|---|---|---|
10.7 | EI | Bloom and Williams, 1981 | LLK |
10.7 ± 0.3 | EI | Guido, Gigli, et al., 1972 | LLK |
10.7 ± 0.3 | EI | Hildenbrand, 1970 | RDSH |

Gas phase thermochemistry data

Quantity | Value | Units | Method | Reference | Comment |
---|---|---|---|---|---|
ΔfH°gas | 91.09 | kJ/mol | Review | Chase, 1998 | Data last reviewed in March, 1966 |
Quantity | Value | Units | Method | Reference | Comment |
S°gas,1 bar | 237.20 | J/mol*K | Review | Chase, 1998 | Data last reviewed in March, 1966 |
Gas Phase Heat Capacity (Shomate Equation)
Cp° = A + B*t + C*t2 + D*t3 +
E/t2
H° − H°298.15= A*t + B*t2/2 +
C*t3/3 + D*t4/4 − E/t + F − H
S° = A*ln(t) + B*t + C*t2/2 + D*t3/3 −
E/(2*t2) + G
Cp = heat capacity (J/mol*K)
H° = standard enthalpy (kJ/mol)
S° = standard entropy (J/mol*K)
t = temperature (K) / 1000.
View plot Requires a JavaScript / HTML 5 canvas capable browser.
Temperature (K) | 3000. to 6000. |
---|---|
A | 37.22873 |
B | 0.626977 |
C | -0.043033 |
D | 0.003669 |
E | -0.194050 |
F | 79.30772 |
G | 280.9761 |
H | 91.08610 |
Reference | Chase, 1998 |
Comment | Data last reviewed in March, 1966 |

Constants of diatomic molecules

Data compiled by: Klaus P. Huber and Gerhard H. Herzberg
Data collected through December, 1975
Symbol | Meaning |
---|---|
State | electronic state and / or symmetry symbol |
Te | minimum electronic energy (cm-1) |
ωe | vibrational constant – first term (cm-1) |
ωexe | vibrational constant – second term (cm-1) |
ωeye | vibrational constant – third term (cm-1) |
Be | rotational constant in equilibrium position (cm-1) |
αe | rotational constant – first term (cm-1) |
γe | rotation-vibration interaction constant (cm-1) |
De | centrifugal distortion constant (cm-1) |
βe | rotational constant – first term, centrifugal force (cm-1) |
re | internuclear distance (Å) |
Trans. | observed transition(s) corresponding to electronic state |
ν00 | position of 0-0 band (units noted in table) |
State | Te | ωe | ωexe | ωeye | Be | αe | γe | De | βe | re | Trans. | ν00 |
---|---|---|---|---|---|---|---|---|---|---|---|---|
F 1Π (1) | 25285.3 | 384.94 Z | 1.65 | 0.1607 | 0.00091 | 0.00000012 | 2.148 | F ↔ X R | 25270.11 Z | |||
↳Bloomenthal, 1938; Asundi and Rao, 1961; missing citation; missing citation; Puri and Mohan, 1970 | ||||||||||||
E 1Σ+ (0+) | 23074.24 | 403.30 Z | 1.62 1 | -0.0093 | 0.1663 | 0.00108 | 1.0E-07 | 2.112 | E ↔ X R | 23068.23 Z | ||
↳Ritschl, 1927; Sinha, 1948; Asundi and Rao, 1961; Rao and Brody, 1961; missing citation; Puri and Mohan, 1970 | ||||||||||||
D 1Π (1) | 22969.74 | 392.89 Z | 1.745 | 0.16777 | 0.00098 | 2.1026 | D ↔ X R | 22958.50 Z | ||||
↳Ritschl, 1927; Asundi and Rao, 1961; Rao and Brody, 1961; missing citation; Puri and Mohan, 1970; Ahmed and Barrow, 1975 | ||||||||||||
C 1Σ+ (0+) | 20630.94 | 396.93 Z | 1.48 2 | 0.1691 | 0.00089 | 0.00000012 | 2.094 | C ↔ X R | 20621.78 Z | |||
↳Ritschl, 1927; Asundi and Rao, 1961; Rao and Brody, 1961; Lagerqvist and Lazarova-Girsamof, 1961; missing citation | ||||||||||||
State | Te | ωe | ωexe | ωeye | Be | αe | γe | De | βe | re | Trans. | ν00 |
B 1Π (1) | 20484.08 | 399.29 Z | 1.61 2 | 0.1684 | 0.00092 | 0.00000012 | 2.099 | B ↔ X R | 20476.07 Z | |||
↳Ritschl, 1927; Asundi and Rao, 1961; Rao and Brody, 1961; Lagerqvist and Lazarova-Girsamof, 1961; missing citation | ||||||||||||
A 1Π (1) | 19001.4 | 407.0 H | 1.70 | A ↔ X R | 18997.2 H | |||||||
↳Ritschl, 1927; missing citation | ||||||||||||
A' (1Σ+) | (13440) | (510) 3 | (A' → X) V | 13479.5 H | ||||||||
↳Rao and Rao, 1974 | ||||||||||||
X 1Σ+ | 0 | 415.29 4 Z | 1.58 | 0.17628802 5 | 0.00099647 6 | 1.27060E-07 7 | -7.6E-11 | 2.051183 8 9 | ||||
↳Manson, De Lucia, et al., 1975 |

References

Chase, 1998
Chase, M.W., Jr.,
NIST-JANAF Themochemical Tables, Fourth Edition,
J. Phys. Chem. Ref. Data, Monograph 9, 1998, 1-1951. [all data]
Bloom and Williams, 1981
Bloom, H.; Williams, D.J.,
A mass spectrometric study of the vapors above the molten salt systems LiCl-CuCl, LiBr-CuBr, and NaI-CuI,
J. Chem. Phys., 1981, 75, 4636. [all data]
Guido, Gigli, et al., 1972
Guido, M.; Gigli, G.; Balducci, G.,
Dissociation energy of CuCl and Cu2Cl2 gaseous molecules,
J. Chem. Phys., 1972, 57, 3731. [all data]
Hildenbrand, 1970
Hildenbrand, D.L.,
Dissociation energies and chemical bonding in the alkaline-earth chlorides from mass spectrometric studies,
J. Chem. Phys., 1970, 52, 5751. [all data]