potassium bromide
- Formula: BrK
- Molecular weight: 119.002
- IUPAC Standard InChIKey: IOLCXVTUBQKXJR-UHFFFAOYSA-M
- CAS Registry Number: 7758-02-3
- Chemical structure:
View 3d structure (requires JavaScript / HTML 5) - Permanent link for this species. Use this link for bookmarking this species for future reference.

Gas phase thermochemistry data

Quantity | Value | Units | Method | Reference | Comment |
---|---|---|---|---|---|
ΔfH°gas | -180.08 | kJ/mol | Review | Chase, 1998 | Data last reviewed in March, 1967 |
Quantity | Value | Units | Method | Reference | Comment |
S°gas,1 bar | 250.53 | J/mol*K | Review | Chase, 1998 | Data last reviewed in March, 1967 |
Gas Phase Heat Capacity (Shomate Equation)
Cp° = A + B*t + C*t2 + D*t3 +
E/t2
H° − H°298.15= A*t + B*t2/2 +
C*t3/3 + D*t4/4 − E/t + F − H
S° = A*ln(t) + B*t + C*t2/2 + D*t3/3 −
E/(2*t2) + G
Cp = heat capacity (J/mol*K)
H° = standard enthalpy (kJ/mol)
S° = standard entropy (J/mol*K)
t = temperature (K) / 1000.
View plot Requires a JavaScript / HTML 5 canvas capable browser.
Temperature (K) | 2500. to 6000. |
---|---|
A | 37.39822 |
B | 0.803207 |
C | -0.003938 |
D | 0.000338 |
E | -0.063850 |
F | -191.4795 |
G | 295.1912 |
H | -180.0794 |
Reference | Chase, 1998 |
Comment | Data last reviewed in March, 1967 |

Condensed phase thermochemistry data

Quantity | Value | Units | Method | Reference | Comment |
---|---|---|---|---|---|
ΔfH°liquid | -376.49 | kJ/mol | Review | Chase, 1998 | Data last reviewed in March, 1967 |
Quantity | Value | Units | Method | Reference | Comment |
S°liquid,1 bar | 105.54 | J/mol*K | Review | Chase, 1998 | Data last reviewed in March, 1967 |
Quantity | Value | Units | Method | Reference | Comment |
ΔfH°solid | -393.80 | kJ/mol | Review | Chase, 1998 | Data last reviewed in March, 1967 |
Quantity | Value | Units | Method | Reference | Comment |
S°solid | 95.92 | J/mol*K | Review | Chase, 1998 | Data last reviewed in March, 1967 |
Liquid Phase Heat Capacity (Shomate Equation)
Cp° = A + B*t + C*t2 + D*t3 +
E/t2
H° − H°298.15= A*t + B*t2/2 +
C*t3/3 + D*t4/4 − E/t + F − H
S° = A*ln(t) + B*t + C*t2/2 + D*t3/3 −
E/(2*t2) + G
Cp = heat capacity (J/mol*K)
H° = standard enthalpy (kJ/mol)
S° = standard entropy (J/mol*K)
t = temperature (K) / 1000.
View plot Requires a JavaScript / HTML 5 canvas capable browser.
Temperature (K) | 1007. to 2500. |
---|---|
A | 69.87322 |
B | -8.511470×10-10 |
C | 5.852203×10-10 |
D | -1.246246×10-10 |
E | -1.695457×10-11 |
F | -397.3252 |
G | 190.0971 |
H | -376.4922 |
Reference | Chase, 1998 |
Comment | Data last reviewed in March, 1967 |
Solid Phase Heat Capacity (Shomate Equation)
Cp° = A + B*t + C*t2 + D*t3 +
E/t2
H° − H°298.15= A*t + B*t2/2 +
C*t3/3 + D*t4/4 − E/t + F − H
S° = A*ln(t) + B*t + C*t2/2 + D*t3/3 −
E/(2*t2) + G
Cp = heat capacity (J/mol*K)
H° = standard enthalpy (kJ/mol)
S° = standard entropy (J/mol*K)
t = temperature (K) / 1000.
View plot Requires a JavaScript / HTML 5 canvas capable browser.
Temperature (K) | 298. to 900. | 900. to 1007. |
---|---|---|
A | 39.22249 | -1166.152 |
B | 63.36459 | 2069.946 |
C | -94.72785 | -1261.945 |
D | 60.44918 | 271.2404 |
E | 0.091212 | 154.9616 |
F | -407.2932 | 286.0182 |
G | 128.6848 | -1287.141 |
H | -393.7985 | -393.7985 |
Reference | Chase, 1998 | Chase, 1998 |
Comment | Data last reviewed in March, 1967 | Data last reviewed in March, 1967 |

Phase change data

Antoine Equation Parameters
log10(P) = A − (B / (T + C))
P = vapor pressure (bar)
T = temperature (K)
View plot Requires a JavaScript / HTML 5 canvas capable browser.
Temperature (K) | A | B | C | Reference | Comment |
---|---|---|---|---|---|
1068. to 1656. | 4.57146 | 6940.81 | -136.349 | Stull, 1947 | Coefficents calculated by NIST from author's data. |

Reaction thermochemistry data

Data compiled as indicated in comments:
M - Michael M. Meot-Ner (Mautner) and Sharon G. Lias
ALS - Hussein Y. Afeefy, Joel F. Liebman, and Stephen E. Stein
Individual Reactions
By formula: K+ + BrK = (K+ • BrK)
Quantity | Value | Units | Method | Reference | Comment |
---|---|---|---|---|---|
ΔrH° | 174. | kJ/mol | MS | Kudin, Gusarov, et al., 1973 | gas phase; Knudsen cell; M |
ΔrH° | 171. | kJ/mol | MS | Chupka, 1959 | gas phase; Knudsen cell; M |
Quantity | Value | Units | Method | Reference | Comment |
ΔrS° | 95.4 | J/mol*K | MS | Chupka, 1959 | gas phase; Knudsen cell; M |
3 +
= 3
+ KBrO3
By formula: 3C5H5NO + BrK = 3C5H5N + KBrO3
Quantity | Value | Units | Method | Reference | Comment |
---|---|---|---|---|---|
ΔrH° | 313.6 ± 9.6 | kJ/mol | Cm | Shaofeng and Pilcher, 1988 | solid phase; ALS |

Gas phase ion energetics data

Data evaluated as indicated in comments:
L - Sharon G. Lias
Data compiled as indicated in comments:
LLK - Sharon G. Lias, Rhoda D. Levin, and Sherif A. Kafafi
B - John E. Bartmess
Quantity | Value | Units | Method | Reference | Comment |
---|---|---|---|---|---|
IE (evaluated) | 7.9 ± 0.1 | eV | N/A | N/A | L |
Electron affinity determinations
EA (eV) | Method | Reference | Comment |
---|---|---|---|
0.642 ± 0.010 | LPES | Miller, Leopold, et al., 1986 | B |
0.610004 | NBAE | De Vreugd, Wijnaendts van Resandt, et al., 1979 | B |
Ionization energy determinations
IE (eV) | Method | Reference | Comment |
---|---|---|---|
7.85 | EVAL | Huber and Herzberg, 1979 | LLK |
7.9 ± 0.1 | PE | Potts and Price, 1977 | LLK |
7.9 ± 0.1 | PE | Potts, Williams, et al., 1974 | LLK |
8.82 ± 0.04 | PE | Potts and Price, 1977 | Vertical value; LLK |
8.1 | PE | Goodman, Allen, et al., 1974 | Vertical value; LLK |
Appearance energy determinations
Ion | AE (eV) | Other Products | Method | Reference | Comment |
---|---|---|---|---|---|
K+ | 25.36 ± 0.04 | Br(-) | PE | Potts and Price, 1977 | LLK |
K+ | 25.04 ± 0.04 | Br(-) | PE | Potts and Price, 1977 | Vertical value; LLK |

Ion clustering data

Data compiled by: Michael M. Meot-Ner (Mautner) and Sharon G. Lias
Clustering reactions
By formula: K+ + BrK = (K+ • BrK)
Quantity | Value | Units | Method | Reference | Comment |
---|---|---|---|---|---|
ΔrH° | 174. | kJ/mol | MS | Kudin, Gusarov, et al., 1973 | gas phase; Knudsen cell |
ΔrH° | 171. | kJ/mol | MS | Chupka, 1959 | gas phase; Knudsen cell |
Quantity | Value | Units | Method | Reference | Comment |
ΔrS° | 95.4 | J/mol*K | MS | Chupka, 1959 | gas phase; Knudsen cell |

Constants of diatomic molecules

Data compiled by: Klaus P. Huber and Gerhard H. Herzberg
Data collected through January, 1977
Symbol | Meaning |
---|---|
State | electronic state and / or symmetry symbol |
Te | minimum electronic energy (cm-1) |
ωe | vibrational constant – first term (cm-1) |
ωexe | vibrational constant – second term (cm-1) |
ωeye | vibrational constant – third term (cm-1) |
Be | rotational constant in equilibrium position (cm-1) |
αe | rotational constant – first term (cm-1) |
γe | rotation-vibration interaction constant (cm-1) |
De | centrifugal distortion constant (cm-1) |
βe | rotational constant – first term, centrifugal force (cm-1) |
re | internuclear distance (Å) |
Trans. | observed transition(s) corresponding to electronic state |
ν00 | position of 0-0 band (units noted in table) |
State | Te | ωe | ωexe | ωeye | Be | αe | γe | De | βe | re | Trans. | ν00 |
---|---|---|---|---|---|---|---|---|---|---|---|---|
Twopeaks in the elctron energy loss spectrum at 19.7 and 23.7 eV Geiger and Pfeiffer, 1968 may be associated with an excitation of an electron from the metal 3p shell of K+ Br-. | ||||||||||||
Continuous absorption above 31000 cm-1, maxima at 36000, 39300, 47600 cm-1. 1 | ||||||||||||
↳Muller, 1927; Levi, 1934 | ||||||||||||
A 2 | A ↔ X | |||||||||||
↳Beutler and Josephy, 1929; Sommermeyer, 1929; Levi, 1934; Barrow and Caunt, 1953; Oldenborg, Gole, et al., 1974; Kaufmann, Kinsey, et al., 1974 | ||||||||||||
X 1Σ+ | 0 | 213 3 | (0.80) | 0.08122109 | 0.00040481 | 7.7E-7 | 4.4619E-8 | -2E-12 | 2.82078 4 | |||
↳Rice and Klemperer, 1957 | ||||||||||||
Rotation sp. | ||||||||||||
↳Fabricand, Carlson, et al., 1953; Rusk and Gordy, 1962 | ||||||||||||
Mol. beam rf el. reson. 5 | ||||||||||||
↳Van Wachem, De Leeuw, et al., 1967; de Leeuw, van Wachem, et al., 1969 |

References

Chase, 1998
Chase, M.W., Jr.,
NIST-JANAF Themochemical Tables, Fourth Edition,
J. Phys. Chem. Ref. Data, Monograph 9, 1998, 1-1951. [all data]
Stull, 1947
Stull, Daniel R.,
Vapor Pressure of Pure Substances. Organic and Inorganic Compounds,
Ind. Eng. Chem., 1947, 39, 4, 517-540, https://doi.org/10.1021/ie50448a022
. [all data]
Kudin, Gusarov, et al., 1973
Kudin, L.S.; Gusarov, A.V.; Gorokhov, L.N.,
Mass Spectrometer Study of Equilibria Involving Ions. 1. Potassium Bromide and Sulfate,
High Temp., 1973, 11, 50. [all data]
Chupka, 1959
Chupka, W.A.,
Dissociation Energies of Some Gaseous Halide Complex Ions and the Hydrated Ion K(H2O)+,
J. Chem. Phys., 1959, 40, 2, 458, https://doi.org/10.1063/1.1729974
. [all data]
Shaofeng and Pilcher, 1988
Shaofeng, L.; Pilcher, G.,
Enthalpy of formation of pyridine-N-oxide: the dissociation enthalpy of the (N-O) bond,
J. Chem. Thermodyn., 1988, 20, 463-465. [all data]
Miller, Leopold, et al., 1986
Miller, T.M.; Leopold, D.G.; Murray, K.K.; Lineberger, W.C.,
Electron Affinities of the Alkali Halides and the Structure of their Negative Ions,
J. Chem. Phys., 1986, 85, 5, 2368, https://doi.org/10.1063/1.451091
. [all data]
De Vreugd, Wijnaendts van Resandt, et al., 1979
De Vreugd, C.; Wijnaendts van Resandt, R.W.; Los, J.; Smith, B.,
Differential Cross Sections for Collisions of Negative Halogen Ions and Alkali Atoms,
Chem. Phys., 1979, 42, 3, 305, https://doi.org/10.1016/0301-0104(79)80078-6
. [all data]
Huber and Herzberg, 1979
Huber, K.P.; Herzberg, G.,
Molecular Spectra and Molecular Structure. IV. Constants of Diatomic Molecules,, Van Nostrand Reinhold Co., 1979, ,1. [all data]
Potts and Price, 1977
Potts, A.W.; Price, W.C.,
Photoelectron studies of ionic materials using molecular beam techniques,
Phys. Scr., 1977, 16, 191. [all data]
Potts, Williams, et al., 1974
Potts, A.W.; Williams, T.A.; Price, W.C.,
Photoelectron spectra and electronic structure of diatomic alkali halides,
Proc. Roy. Soc. London A, 1974, 341, 147. [all data]
Goodman, Allen, et al., 1974
Goodman, T.D.; Allen, J.D., Jr.; Cusachs, L.C.; Schweitzer, G.K.,
The photoelectron spectra of gaseous alkali halides,
J. Electron Spectrosc. Relat. Phenom., 1974, 3, 289. [all data]
Geiger and Pfeiffer, 1968
Geiger, J.; Pfeiffer, H.-C.,
Untersuchung der Anregung innerer Elektronen von Alkalihalogenidmolekulen im Energieverlustspektrum von 25 keV-Elektronen,
Z. Phys., 1968, 208, 105. [all data]
Muller, 1927
Muller, L.A.,
4. absorptionsspektren der alkalihalogenide in wasseriger losung und im dampf,
Ann. Phys. (Leipzig), 1927, 82, 39. [all data]
Levi, 1934
Levi,
Dissertation, Berlin, 1934, 0. [all data]
Beutler and Josephy, 1929
Beutler, H.; Josephy, B.,
Resonanz bei Stoben in der fluoreszenz und chemilumineszenz,
Z. Phys., 1929, 53, 747. [all data]
Sommermeyer, 1929
Sommermeyer, K.,
Ein neues spektrum der gasformigen alkalihalogenide und seine deutung,
Z. Phys., 1929, 56, 548. [all data]
Barrow and Caunt, 1953
Barrow, R.F.; Caunt, A.D.,
The ultra-violet absorption spectra of some gaseous alkali-metal halides and the dissociation energy of fluorine,
Proc. R. Soc. London A, 1953, 219, 120. [all data]
Oldenborg, Gole, et al., 1974
Oldenborg, R.C.; Gole, J.L.; Zare, R.N.,
Chemiluminescent spectra of alkali-halogen reactions,
J. Chem. Phys., 1974, 60, 4032. [all data]
Kaufmann, Kinsey, et al., 1974
Kaufmann, K.J.; Kinsey, J.L.; Palmer, H.B.; Tewarson, A.,
Chemiluminescent emission spectra and possible upper-state potentials of KCl and KBr,
J. Chem. Phys., 1974, 61, 1865. [all data]
Rice and Klemperer, 1957
Rice, S.A.; Klemperer, W.,
Spectra of the alkali halides. II. The infrared spectra of the sodium and potassium halides, RbCl, and CsCl,
J. Chem. Phys., 1957, 27, 573. [all data]
Fabricand, Carlson, et al., 1953
Fabricand, B.P.; Carlson, R.O.; Lee, C.A.; Rabi, I.I.,
Molecular beam investigation of rotational transitions. II. The rotational levels of KBr and their hyperfine structure,
Phys. Rev., 1953, 91, 1403. [all data]
Rusk and Gordy, 1962
Rusk, J.R.; Gordy, W.,
Millimeter wave molecular beam spectroscopy: alkali bromides and iodides,
Phys. Rev., 1962, 127, 817. [all data]
Van Wachem, De Leeuw, et al., 1967
Van Wachem, R.; De Leeuw, F.H.; Dymanus, A.,
Dipole moments of KF and KBr measured by the molecular-beam electric-resonance method,
J. Chem. Phys., 1967, 47, 2256. [all data]
de Leeuw, van Wachem, et al., 1969
de Leeuw, F.H.; van Wachem, R.; Dymanus, A.,
Radio-frequency spectrum of KBr by the molecular-beam electric-resonance method,
J. Chem. Phys., 1969, 50, 1393. [all data]
Davidovits and Brodhead, 1967
Davidovits, P.; Brodhead, D.C.,
Ultraviolet absorption cross sections for the alkali halide vapors,
J. Chem. Phys., 1967, 46, 2968. [all data]
Brewer and Brackett, 1961
Brewer, L.; Brackett, E.,
The dissociation energies of gaseous alkali halides,
Chem. Rev., 1961, 61, 425. [all data]
Bulewicz, Phillips, et al., 1961
Bulewicz, E.M.; Phillips, L.F.; Sugden, T.M.,
Determination of dissociation constants and heats of formation of simple molecules by flame photometry. Part 8. Stabilities of the gaseous diatomic halides of certain metals,
Trans. Faraday Soc., 1961, 57, 921. [all data]