Silane, diphenyl-
- Formula: C12H12Si
- Molecular weight: 184.3092
- IUPAC Standard InChIKey: VDCSGNNYCFPWFK-UHFFFAOYSA-N
- CAS Registry Number: 775-12-2
- Chemical structure:
View 3d structure (requires JavaScript / HTML 5) - Other names: Diphenylsilane

Phase change data

Data compiled by: Robert L. Brown and Stephen E. Stein
Reduced pressure boiling point
Tboil (K) | Pressure (bar) | Reference |
---|---|---|
368. to 370. | 0.017 | PCR Inc., 1990 |

Gas phase ion energetics data

Data compiled as indicated in comments:
LLK - Sharon G. Lias, Rhoda D. Levin, and Sherif A. Kafafi
Ionization energy determinations
IE (eV) | Method | Reference | Comment |
---|---|---|---|
8.8 | PE | Distefano, Pignataro, et al., 1976 | LLK |
9.23 ± 0.05 | PE | Distefano, Pignataro, et al., 1976 | Vertical value; LLK |

Kovats' RI, non-polar column, isothermal

Column type | Active phase | Temperature (C) | I | Reference | Comment |
---|---|---|---|---|---|
Packed | Polymethylsiloxane, (PMS-20000) | 50. | 1441.8 | Ainshtein and Shulyatieva, 1972 | He, Chromosorb W; Column length: 2. m |

References

PCR Inc., 1990
PCR Inc.,
Research Chemicals Catalog 1990-1991, PCR Inc., Gainesville, FL, 1990, 1. [all data]
Distefano, Pignataro, et al., 1976
Distefano, G.; Pignataro, S.; Szepes, L.; Borossay, J.,
Photoelectron spectroscopy study of the triphenyl derivatives of the group IV elements,
J. Organomet. Chem., 1976, 104, 173. [all data]
Lang (editor), 1967
Lang (editor), L.,
Absorption Spectra in the Ultraviolet and Visible Region, 1967, 9, 195. [all data]
Ainshtein and Shulyatieva, 1972
Ainshtein, A.A.; Shulyatieva, T.I.,
Retention indices of alkyl- and arylchlorosilanes,
Zh. Anal. Khim., 1972, 27, 816-821. [all data]