Thiacyclohexane, 4-difluoromethylene
- Formula: C6H8F2S
- Molecular weight: 150.190
- IUPAC Standard InChIKey: OGXWQSPYMJLQLF-UHFFFAOYSA-N
- CAS Registry Number: 77471-71-7
- Chemical structure:
View 3d structure (requires JavaScript / HTML 5) - Permanent link for this species. Use this link for bookmarking this species for future reference.

Gas phase ion energetics data

Data compiled as indicated in comments:
LLK - Sharon G. Lias, Rhoda D. Levin, and Sherif A. Kafafi
Ionization energy determinations
IE (eV) | Method | Reference | Comment |
---|---|---|---|
9.34 | PE | Sarneel, Worrell, et al., 1980 | LLK |

References

Sarneel, Worrell, et al., 1980
Sarneel, R.; Worrell, C.W.; Pasman, P.; Verhoeven, J.W.; Mes, G.F.,
The photoelectron spectra of 4-methylene thiacyclohexane derivatives through-bond interaction,
Tetrahedron, 1980, 36, 3241. [all data]