Tetracyclo[4.2.2.26,5.01,6]dodecane

Gas phase ion energetics data

Data compiled by: Sharon G. Lias, John E. Bartmess, Joel F. Liebman, John L. Holmes, Rhoda D. Levin, and W. Gary Mallard

Ionization energy determinations

IE (eV) Method Reference Comment
7.9PEGleiter, Krennrich, et al., 1986
8.7PEGleiter, Krennrich, et al., 1986Vertical value

References

Gleiter, Krennrich, et al., 1986
Gleiter, R.; Krennrich, G.; Bischof, P.; Tsuji, T.; Nishida, S., 103. PE spectra of dewar benzenes, bridged by a cyclohexadiene or a butadiene unit, Helv. Chim. Acta, 1986, 69, 962. [all data]