1-Butyne, 3,3-dimethyl-1-dichlorophosphinyl-
- Formula: C6H9Cl2P
- Molecular weight: 183.015
- IUPAC Standard InChIKey: PGGZSSMNDXHDNO-UHFFFAOYSA-N
- CAS Registry Number: 77376-08-0
- Chemical structure:
View 3d structure (requires JavaScript / HTML 5) - Permanent link for this species. Use this link for bookmarking this species for future reference.

Gas phase ion energetics data

Data compiled as indicated in comments:
LLK - Sharon G. Lias, Rhoda D. Levin, and Sherif A. Kafafi
Ionization energy determinations
IE (eV) | Method | Reference | Comment |
---|---|---|---|
9.58 | PE | Cabelli, Cowley, et al., 1981 | Vertical value; LLK |

References

Cabelli, Cowley, et al., 1981
Cabelli, D.E.; Cowley, A.H.; Dewar, M.J.S.,
UPE studies of conjugation involving group 5A elements. 2. Substituted tert-butylacetylenes,
J. Am. Chem. Soc., 1981, 103, 3290. [all data]