Pyridine, 2-(2-(2-nitrophenyl)ethenyl)-, trans
- Formula: C13H10N2O2
- Molecular weight: 226.2307
- IUPAC Standard InChIKey: YADNATDOWRSAOC-CMDGGOBGSA-N
- CAS Registry Number: 77340-84-2
- Chemical structure:
View 3d structure (requires JavaScript / HTML 5) - Species with the same structure:
- Other names: (E)-2-(2-Nitrophenylethenyl)pyridine

Gas phase ion energetics data

Data compiled as indicated in comments:
LLK - Sharon G. Lias, Rhoda D. Levin, and Sherif A. Kafafi
Ionization energy determinations
IE (eV) | Method | Reference | Comment |
---|---|---|---|
8.3 | EI | Schubert, Ramana, et al., 1980 | LLK |
Appearance energy determinations
Ion | AE (eV) | Other Products | Method | Reference | Comment |
---|---|---|---|---|---|
C13H10N+ | 8.8 | NO2 | EI | Schubert, Ramana, et al., 1980 | LLK |

References

Schubert, Ramana, et al., 1980
Schubert, R.; Ramana, D.V.; Grutzmacher, H.-F.,
Freisetzung kinetischer energie und hammond-postulat bei der intramolekularen aromatischen substitution in 2-stilbazol-ionen,
Chem. Ber., 1980, 113, 3758. [all data]