aluminium bromide
- Formula: AlBr3
- Molecular weight: 266.694
- CAS Registry Number: 7727-15-3

Reaction thermochemistry data

Data compiled by: José A. Martinho Simões
Individual Reactions
AlBr3 (cr) + 2 (l) = 3C4H10AlBr (l)
By formula: AlBr3 (cr) + 2C6H15Al (l) = 3C4H10AlBr (l)
Quantity | Value | Units | Method | Reference | Comment |
---|---|---|---|---|---|
ΔrH° | -91.4 ± 1.8 | kJ/mol | RSC | Smith, 1974 | Please also see Pedley and Rylance, 1977. |

Gas phase ion energetics data

Data compiled as indicated in comments:
LLK - Sharon G. Lias, Rhoda D. Levin, and Sherif A. Kafafi
RDSH - Henry M. Rosenstock, Keith Draxl, Bruce W. Steiner, and John T. Herron
Ionization energy determinations
IE (eV) | Method | Reference | Comment |
---|---|---|---|
10.4 | PE | Barker, Lappert, et al., 1975 | LLK |
12.2 ± 0.5 | EI | Porter and Zeller, 1960 | RDSH |
10.91 | PE | Barker, Lappert, et al., 1975 | Vertical value; LLK |
10.91 | PE | Lappert, Pedley, et al., 1974 | Vertical value; LLK |
Appearance energy determinations
Ion | AE (eV) | Other Products | Method | Reference | Comment |
---|---|---|---|---|---|
Al+ | 18.3 ± 0.5 | ? | EI | Porter and Zeller, 1960 | RDSH |
AlBr+ | 17.7 ± 0.5 | ? | EI | Porter and Zeller, 1960 | RDSH |
AlBr2+ | 13.3 ± 0.5 | Br | EI | Porter and Zeller, 1960 | RDSH |

Gas phase thermochemistry data

Quantity Value Units Method Reference Comment
Δfgas-410.45kJ/molReviewChase, 1998Data last reviewed in September, 1979
Quantity Value Units Method Reference Comment
gas,1 bar349.41J/mol*KReviewChase, 1998Data last reviewed in September, 1979

Gas Phase Heat Capacity (Shomate Equation)

Cp° = A + B*t + C*t2 + D*t3 + E/t2
H° − H°298.15= A*t + B*t2/2 + C*t3/3 + D*t4/4 − E/t + F − H
S° = A*ln(t) + B*t + C*t2/2 + D*t3/3 − E/(2*t2) + G
    Cp = heat capacity (J/mol*K)
    H° = standard enthalpy (kJ/mol)
    S° = standard entropy (J/mol*K)
    t = temperature (K) / 1000.

View plot Requires a JavaScript / HTML 5 canvas capable browser.

View table.

Temperature (K) 1500. - 6000.
A 82.35200
B 0.674963
C -0.182731
D 0.015584
E -0.648411
F -437.2071
G 445.2320
H -410.4504
ReferenceChase, 1998
Comment Data last reviewed in September, 1979

Condensed phase thermochemistry data

Quantity Value Units Method Reference Comment
Δfliquid-501.38kJ/molReviewChase, 1998Data last reviewed in September, 1979
Quantity Value Units Method Reference Comment
liquid,1 bar206.48J/mol*KReviewChase, 1998Data last reviewed in September, 1979
Quantity Value Units Method Reference Comment
Δfsolid-511.28kJ/molReviewChase, 1998Data last reviewed in September, 1979
Quantity Value Units Method Reference Comment
solid180.03J/mol*KReviewChase, 1998Data last reviewed in September, 1979

Liquid Phase Heat Capacity (Shomate Equation)

Cp° = A + B*t + C*t2 + D*t3 + E/t2
H° − H°298.15= A*t + B*t2/2 + C*t3/3 + D*t4/4 − E/t + F − H
S° = A*ln(t) + B*t + C*t2/2 + D*t3/3 − E/(2*t2) + G
    Cp = heat capacity (J/mol*K)
    H° = standard enthalpy (kJ/mol)
    S° = standard entropy (J/mol*K)
    t = temperature (K) / 1000.

View plot Requires a JavaScript / HTML 5 canvas capable browser.

View table.

Temperature (K) 370.6 - 1500.
A 124.9652
B -3.397768×10-8
C 3.287109×10-8
D -1.033527×10-8
E -3.983822×10-10
F -538.6398
G 357.7086
H -501.3813
ReferenceChase, 1998
Comment Data last reviewed in September, 1979

Solid Phase Heat Capacity (Shomate Equation)

Cp° = A + B*t + C*t2 + D*t3 + E/t2
H° − H°298.15= A*t + B*t2/2 + C*t3/3 + D*t4/4 − E/t + F − H
S° = A*ln(t) + B*t + C*t2/2 + D*t3/3 − E/(2*t2) + G
    Cp = heat capacity (J/mol*K)
    H° = standard enthalpy (kJ/mol)
    S° = standard entropy (J/mol*K)
    t = temperature (K) / 1000.

View plot Requires a JavaScript / HTML 5 canvas capable browser.

View table.

Temperature (K) 298. - 370.6
A -1150.935
B 5961.907
C -10063.57
D 5872.077
E 18.93013
F -292.3888
G -2488.430
H -511.2848
ReferenceChase, 1998
Comment Data last reviewed in September, 1979

References

Smith, 1974
Smith, M.B.,
J. Organometal. Chem., 1974, 76, 171. [all data]
Pedley and Rylance, 1977
Pedley, J.B.; Rylance, J.,
Computer Analysed Thermochemical Data: Organic and Organometallic Compounds, University of Sussex, Brigton, 1977. [all data]
Barker, Lappert, et al., 1975
Barker, G.K.; Lappert, M.F.; Pedley, J.B.; Sharp, G.J.; Westwood, N.P.C.,
Bonding studies of boron and the group 3-5 elements. Part XV. He(I) photoelectron spectra of monomeric group 3 tri-halide, trimethyl, and mixed halogenomethyl species,
J. Chem. Soc. Dalton Trans., 1975, 1765. [all data]
Porter and Zeller, 1960
Porter, R.F.; Zeller, E.E.,
Mass spectra of aluminum(III) halides and the heats of dissociation of Al2F6(g) and LiFAlF3(g),
J. Chem. Phys., 1960, 33, 858. [all data]
Lappert, Pedley, et al., 1974
Lappert, M.F.; Pedley, J.B.; Sharp, G.J.; Westwood, N.P.C.,
Bonding studies of compounds of boron and the Group III and IV elements. XII. Variable temperature HeI photoelectron spectra of Group III halides, 2MX3<=>M2X6(M=Al or Ga, X=Cl, Br, or I),
J. Electron Spectrosc. Relat. Phenom., 1974, 3, 237. [all data]