Thionyl chloride
- Formula: Cl2OS
- Molecular weight: 118.970
- IUPAC Standard InChIKey: FYSNRJHAOHDILO-UHFFFAOYSA-N
- CAS Registry Number: 7719-09-7
- Chemical structure:
View 3d structure (requires JavaScript / HTML 5) - Other names: Sulfinyl chloride; Sulfur chloride oxide (Cl2SO); Sulfurous dichloride; Sulfurous oxychloride; Thionyl dichloride; SOCl2; Sulfur chloride oxide; UN 1836; Sulfinyl dichloride; Sulfur oxychloride; Sulfur oxychloride (SOCl2); Thionyl chloride (SOCl2)

Phase change data

Data compiled as indicated in comments:
AC - William E. Acree, Jr., James S. Chickos
Enthalpy of vaporization
ΔvapH (kJ/mol) | Temperature (K) | Reference | Comment |
---|---|---|---|
32.4 | 272. | Dykyj, Svoboda, et al., 1999 | Based on data from 257. to 372. K.; AC |
Antoine Equation Parameters
log10(P) = A − (B / (T + C))
P = vapor pressure (bar)
T = temperature (K)
View plot Requires a JavaScript / HTML 5 canvas capable browser.
Temperature (K) | A | B | C | Reference | Comment |
---|---|---|---|---|---|
220.3 to 348.6 | 4.34394 | 1399.91 | -26.202 | Stull, 1947 | Coefficents calculated by NIST from author's data. |

Reaction thermochemistry data

Data compiled as indicated in comments:
ALS - Hussein Y. Afeefy, Joel F. Liebman, and Stephen E. Stein
B - John E. Bartmess
Individual Reactions
By formula: C8H20N2OS + 2C4H12ClN = 4C4H11N + Cl2OS
Quantity | Value | Units | Method | Reference | Comment |
---|---|---|---|---|---|
ΔrH° | 379.5 ± 4.2 | kJ/mol | Cm | Claydon and Mortimer, 1962 | liquid phase; Reanalyzed by Cox and Pilcher, 1970, Original value = 393. ± 4.2 kJ/mol; ALS |
+
= Cl3OS-
By formula: Cl- + Cl2OS = Cl3OS-
Quantity | Value | Units | Method | Reference | Comment |
---|---|---|---|---|---|
ΔrH° | 85.4 ± 7.5 | kJ/mol | CIDT | Bachrach, Hayes, et al., 2001 | gas phase; B |

Gas phase ion energetics data

Data compiled by: Sharon G. Lias, Rhoda D. Levin, and Sherif A. Kafafi
Ionization energy determinations
IE (eV) | Method | Reference | Comment |
---|---|---|---|
11.07 | PE | Bock and Solouki, 1974 | Vertical value |
11.3 | PE | Chadwick, Frost, et al., 1973 | Vertical value |
11.12 | PE | Mines, Thomas, et al., 1972 | Vertical value |
11.3 | PE | Chadwick, Cornford, et al., 1972 | Vertical value |
11.13 | PE | Bock and Solouki, 1972 | Vertical value |

Ion clustering data

Data compiled by: John E. Bartmess
Clustering reactions
+
= Cl3OS-
By formula: Cl- + Cl2OS = Cl3OS-
Quantity | Value | Units | Method | Reference | Comment |
---|---|---|---|---|---|
ΔrH° | 85.4 ± 7.5 | kJ/mol | CIDT | Bachrach, Hayes, et al., 2001 | gas phase |

Vibrational and/or electronic energy levels

Data compiled by: Takehiko Shimanouchi
Symmetry: Cs Symmetry Number σ = 1
Sym. | No | Approximate | Selected Freq. | Infrared | Raman | Comments | ||||
---|---|---|---|---|---|---|---|---|---|---|
Species | type of mode | Value | Rating | Value | Phase | Value | Phase | |||
a' | 1 | SO str | 1251 | C | 1251 VS | gas | 1230 W p | liq. | ||
a' | 2 | SCl2 s-str | 492 | C | 492 VS | gas | 490 M p | liq. | ||
a' | 3 | OSCl deform | 344 | D | 344 S p | liq. | ||||
a' | 4 | SCl2 scis | 194 | D | 194 M p | liq. | ||||
a | 5 | SCl2 a-str | 455 | C | 455 VS | gas | 445 W dp | liq. | ||
a | 6 | OSCl deform | 284 | D | 284 M dp | liq. | ||||
Source: Shimanouchi, 1972

References

Dykyj, Svoboda, et al., 1999
Dykyj, J.; Svoboda, J.; Wilhoit, R.C.; Frenkel, M.L.; Hall, K.R.,
Vapor Pressure of Chemicals: Part A. Vapor Pressure and Antoine Constants for Hydrocarbons and Sulfur, Selenium, Tellurium and Hydrogen Containing Organic Compounds, Springer, Berlin, 1999, 373. [all data]
Stull, 1947
Stull, Daniel R.,
Vapor Pressure of Pure Substances. Organic and Inorganic Compounds,
Ind. Eng. Chem., 1947, 39, 4, 517-540, https://doi.org/10.1021/ie50448a022
. [all data]
Claydon and Mortimer, 1962
Claydon, A.P.; Mortimer, C.T.,
Heats of formation and bond energies. Part VIII. Diethylaminotrimethylsilane, NN'-dithiodiethylamine, NN'-thionylbisdiethylamine, and NN'-sulphurylbisdiethylamine,
J. Chem. Soc., 1962, 3212-3216. [all data]
Cox and Pilcher, 1970
Cox, J.D.; Pilcher, G.,
Thermochemistry of Organic and Organometallic Compounds, Academic Press, New York, 1970, 1-636. [all data]
Bachrach, Hayes, et al., 2001
Bachrach, S.M.; Hayes, J.M.; Check, C.E.; Sunderlin, L.S.,
Potential energy surface of SOCl3-,
J. Phys. Chem. A, 2001, 105, 41, 9595-9597, https://doi.org/10.1021/jp012412f
. [all data]
Bock and Solouki, 1974
Bock, H.; Solouki, B.,
Photoelektronenspektren und molekuleigenschaften, XXXV. Sulfoxide X2SO - beispiele fur den nutzen von korrelations - diagrammen bei der diskussion von substituenteneffekten und von geometrischen storungen,
Chem. Ber., 1974, 107, 2299. [all data]
Chadwick, Frost, et al., 1973
Chadwick, D.; Frost, D.C.; Herring, F.G.; Katrib, A.; McDowell, C.A.; McLean, R.A.N.,
Photoelectron spectra of sulfuryl and thionyl halides,
Can. J. Chem., 1973, 51, 1893. [all data]
Mines, Thomas, et al., 1972
Mines, G.W.; Thomas, R.K.; Thompson, H.,
Photoelectron spectra of compounds containing thionyl and sulphuryl groups,
Proc. R. Soc. London A:, 1972, 329, 275. [all data]
Chadwick, Cornford, et al., 1972
Chadwick, D.; Cornford, A.B.; Frost, D.C.; Herring, F.G.; Katrib, A.; McDowell, C.A.; McLean, R.A.N.,
Photoelectron spectra of some dihalocompounds
in Electron spectroscopy, ed. D.A. Shirley (North-Holland Publixhing Co, Amsterdam), 1972, 453. [all data]
Bock and Solouki, 1972
Bock, H.; Solouki, B.,
The sulfoxide bond,
Angew. Chem. Int. Ed. Engl., 1972, 11, 436. [all data]
Shimanouchi, 1972
Shimanouchi, T.,
Tables of Molecular Vibrational Frequencies Consolidated Volume II,
J. Phys. Chem. Ref. Data, 1972, 6, 3, 993-1102. [all data]