Benzene,1-chloro-4-(phenylmethoxy)-
- Formula: C13H11ClO
- Molecular weight: 218.679
- IUPAC Standard InChIKey: OBCBJNFGAMHBTC-UHFFFAOYSA-N
- CAS Registry Number: 7700-27-8
- Chemical structure:
View 3d structure (requires JavaScript / HTML 5) - Permanent link for this species. Use this link for bookmarking this species for future reference.

Gas phase ion energetics data

Data compiled as indicated in comments:
LLK - Sharon G. Lias, Rhoda D. Levin, and Sherif A. Kafafi
RDSH - Henry M. Rosenstock, Keith Draxl, Bruce W. Steiner, and John T. Herron
Ionization energy determinations
IE (eV) | Method | Reference | Comment |
---|---|---|---|
8.34 | CTS | Weschke, Timpe, et al., 1979 | LLK |
8.3 | EI | Ward, Cooks, et al., 1969 | RDSH |
Appearance energy determinations
Ion | AE (eV) | Other Products | Method | Reference | Comment |
---|---|---|---|---|---|
C6H4OCl+ | 12.7 | ? | EI | Ward, Cooks, et al., 1969 | RDSH |
C7H7+ | 9.7 | ? | EI | Ward, Cooks, et al., 1969 | RDSH |

References

Weschke, Timpe, et al., 1979
Weschke, W.; Timpe, H.-J.; Just, G.,
Untersuchungen an EDA-Komplexen von Benzylarylethern,
J. Prakt. Chem., 1979, 321, 605. [all data]
Ward, Cooks, et al., 1969
Ward, R.S.; Cooks, R.d.; Williams, D.H.,
Substituent effects in mass spectrometry. Mass spectra of substituted phenyl benzyl ethers,
J. Am. Chem. Soc., 1969, 91, 2727. [all data]