4-t-Butylbenzeneamine
- Formula: C10H15N
- Molecular weight: 149.2328
- IUPAC Standard InChIKey: WRDWWAVNELMWAM-UHFFFAOYSA-N
- CAS Registry Number: 769-92-6
- Chemical structure:
View 3d structure (requires JavaScript / HTML 5) - Species with the same structure:
- Other names: 4-tert-Butylaniline; p-tert-Butylaniline; p-t-Butylaniline; 4-(t-Butyl)aniline; Benzenamine, 4-(1,1-dimethylethyl)-; Aniline, p-tert-butyl-; 4-Amino-tert-butylbenzene; 4-tert-Butylbenzenamine; 4-tert-Butylbenzeneamine; Aniline, 4-tert-butyl-; 4-(1,1-Dimethylethyl)benzenamine

Phase change data

Data compiled by: Robert L. Brown and Stephen E. Stein
Quantity | Value | Units | Method | Reference | Comment |
---|---|---|---|---|---|
Tboil | 503. to 505. | K | N/A | Frinton Laboratories Inc., 1986 |
Reduced pressure boiling point
Tboil (K) | Pressure (bar) | Reference |
---|---|---|
364.7 | 0.004 | Aldrich Chemical Company Inc., 1990 |

Gas phase ion energetics data

Data compiled as indicated in comments:
LBLHLM - Sharon G. Lias, John E. Bartmess, Joel F. Liebman, John L. Holmes, Rhoda D. Levin, and W. Gary Mallard
RDSH - Henry M. Rosenstock, Keith Draxl, Bruce W. Steiner, and John T. Herron
Ionization energy determinations
IE (eV) | Method | Reference | Comment |
---|---|---|---|
7.35 ± 0.02 | EI | Orlov, Misharev, et al., 1986 | LBLHLM |
7.7 ± 0.1 | CTS | Farrell and Newton, 1966 | RDSH |
Appearance energy determinations
Ion | AE (eV) | Other Products | Method | Reference | Comment |
---|---|---|---|---|---|
C9H12N+ | 9.4 ± 0.1 | CH3 | EI | Orlov, Misharev, et al., 1986 | LBLHLM |

References

Frinton Laboratories Inc., 1986
Frinton Laboratories Inc.,
Catalog Number 11, Frinton Laboratories Inc., Vineland, NJ, 1986, 99. [all data]
Aldrich Chemical Company Inc., 1990
Aldrich Chemical Company Inc.,
Catalog Handbook of Fine Chemicals, Aldrich Chemical Company, Inc., Milwaukee WI, 1990, 1. [all data]
Orlov, Misharev, et al., 1986
Orlov, V.; Misharev, A.; Takhistox, V.,
Determination of the enthalpy of formation of para-substituted α,α-dimethyl cations in the gas phase,
Izv. Akad. Nauk SSSR Ser. Khim., 1986, 9, 2006. [all data]
Farrell and Newton, 1966
Farrell, P.G.; Newton, J.,
Ionization potentials of primary aromatic amines and aza-hydrocarbons,
Tetrahedron Lett., 1966, 5517. [all data]