Hydrochloric acid-d
- Formula: ClD
- Molecular weight: 37.467
- IUPAC Standard InChIKey: VEXZGXHMUGYJMC-DYCDLGHISA-N
- CAS Registry Number: 7698-05-7
- Chemical structure:
View 3d structure (requires JavaScript / HTML 5) - Isotopologues:
- Other names: [2H]hydrogen chloride

Gas phase thermochemistry data

Quantity | Value | Units | Method | Reference | Comment |
---|---|---|---|---|---|
ΔfH°gas | -93.35 | kJ/mol | Review | Chase, 1998 | Data last reviewed in June, 1977 |
Quantity | Value | Units | Method | Reference | Comment |
S°gas,1 bar | 192.74 | J/mol*K | Review | Chase, 1998 | Data last reviewed in June, 1977 |
Gas Phase Heat Capacity (Shomate Equation)
Cp° = A + B*t + C*t2 + D*t3 +
E/t2
H° − H°298.15= A*t + B*t2/2 +
C*t3/3 + D*t4/4 − E/t + F − H
S° = A*ln(t) + B*t + C*t2/2 + D*t3/3 −
E/(2*t2) + G
Cp = heat capacity (J/mol*K)
H° = standard enthalpy (kJ/mol)
S° = standard entropy (J/mol*K)
t = temperature (K) / 1000.
View plot Requires a JavaScript / HTML 5 canvas capable browser.
Temperature (K) | 298. to 1300. | 1300. to 6000. |
---|---|---|
A | 25.37374 | 35.62245 |
B | 6.860463 | 1.287362 |
C | 3.751108 | -0.175269 |
D | -2.652724 | 0.011558 |
E | 0.133641 | -3.613746 |
F | -100.7942 | -111.3208 |
G | 222.0139 | 226.8255 |
H | -93.34504 | -93.34504 |
Reference | Chase, 1998 | Chase, 1998 |
Comment | Data last reviewed in June, 1977 | Data last reviewed in June, 1977 |

Phase change data

Data compiled by: Thermodynamics Research Center, NIST Boulder Laboratories, Chris Muzny director
Quantity | Value | Units | Method | Reference | Comment |
---|---|---|---|---|---|
Ptriple | 0.12510 | bar | N/A | Henderson, Lewis, et al., 1986 | Uncertainty assigned by TRC = 0.00007 bar |
Ptriple | 0.12530 | bar | N/A | Henderson, Lewis, et al., 1986 | Uncertainty assigned by TRC = 0.00007 bar |
Ptriple | 0.12520 | bar | N/A | Henderson, Lewis, et al., 1986 | Uncertainty assigned by TRC = 0.00005 bar; estimated for pure DCl, based on amount of H in samples |
Quantity | Value | Units | Method | Reference | Comment |
Tc | 323.5 | K | N/A | Henderson, Lewis, et al., 1986 | Uncertainty assigned by TRC = 0.32 K |
Quantity | Value | Units | Method | Reference | Comment |
Pc | 80.20 | bar | N/A | Henderson, Lewis, et al., 1986 | Uncertainty assigned by TRC = 0.0801 bar; Vapor Pressure measured up to 226 K and Pc determined from fitted Wagner equation |

Reaction thermochemistry data

Data compiled by: Michael M. Meot-Ner (Mautner) and Sharon G. Lias
Individual Reactions
By formula: Cl- + DCl = (Cl- • DCl)
Bond type: Hydrogen bond (negative ion to hydride)
Free energy of reaction
ΔrG° (kJ/mol) | T (K) | Method | Reference | Comment |
---|---|---|---|---|
70.3 | 300. | ICR | Larson and McMahon, 1987 | gas phase; switching reaction(Cl-)HCl; Caldwell and Kebarle, 1985 |

Gas phase ion energetics data

Data compiled as indicated in comments:
RDSH - Henry M. Rosenstock, Keith Draxl, Bruce W. Steiner, and John T. Herron
Ionization energy determinations
IE (eV) | Method | Reference | Comment |
---|---|---|---|
12.756 ± 0.005 | PE | Weiss, Lawrence, et al., 1970 | RDSH |

Ion clustering data

Data compiled by: Michael M. Meot-Ner (Mautner) and Sharon G. Lias
Clustering reactions
By formula: Cl- + DCl = (Cl- • DCl)
Bond type: Hydrogen bond (negative ion to hydride)
Free energy of reaction
ΔrG° (kJ/mol) | T (K) | Method | Reference | Comment |
---|---|---|---|---|
70.3 | 300. | ICR | Larson and McMahon, 1987 | gas phase; switching reaction(Cl-)HCl; Caldwell and Kebarle, 1985 |

References

Chase, 1998
Chase, M.W., Jr.,
NIST-JANAF Themochemical Tables, Fourth Edition,
J. Phys. Chem. Ref. Data, Monograph 9, 1998, 1-1951. [all data]
Henderson, Lewis, et al., 1986
Henderson, C.; Lewis, D.G.; Prichard, P.C.; Staveley, L.A.K.; Fonseca, I.M.A.; Lobo, L.Q.,
Some thermodynamic properties of hydrogen chloride and deuterium chloride,
J. Chem. Thermodyn., 1986, 18, 1077. [all data]
Larson and McMahon, 1987
Larson, J.W.; McMahon, T.B.,
Isotope Effects in Proton Transfer Reactions. An Ion Cyclotron Resonance Determination of the Equilibrium Deuterium Isotope Effect in the Bichloride Ion,
J. Phys. Chem., 1987, 91, 3, 554, https://doi.org/10.1021/j100287a013
. [all data]
Caldwell and Kebarle, 1985
Caldwell, G.; Kebarle, P.,
The hydrogen bond energies of the bihalide ions XHX- and YHX-,
Can. J. Chem., 1985, 63, 1399. [all data]
Weiss, Lawrence, et al., 1970
Weiss, M.J.; Lawrence, G.M.; Young, R.A.,
Photoelectron spectroscopy of HCI and DCI using molecular beams,
J. Chem. Phys., 1970, 52, 2867. [all data]