N,N,2,4-Tetramethylbenzenamine
- Formula: C10H15N
- Molecular weight: 149.2328
- IUPAC Standard InChIKey: DZXAIYQRCQALGE-UHFFFAOYSA-N
- CAS Registry Number: 769-53-9
- Chemical structure:
View 3d structure (requires JavaScript / HTML 5) - Other names: N,N-Dimethyl-2,4-xylidine

Gas phase ion energetics data

Data compiled as indicated in comments:
LBLHLM - Sharon G. Lias, John E. Bartmess, Joel F. Liebman, John L. Holmes, Rhoda D. Levin, and W. Gary Mallard
RDSH - Henry M. Rosenstock, Keith Draxl, Bruce W. Steiner, and John T. Herron
Ionization energy determinations
IE (eV) | Method | Reference | Comment |
---|---|---|---|
7.17 | CTS | Farrell and Newton, 1965 | RDSH |
7.79 | PE | Rozeboom, Houk, et al., 1982 | Vertical value; LBLHLM |

Kovats' RI, polar column, isothermal

Column type | Active phase | Temperature (C) | I | Reference | Comment |
---|---|---|---|---|---|
Packed | PEG-20M | 210. | 1798.1 | Still, Evans, et al., 1972 | Chromosorb G; Column length: 3. m |

Van Den Dool and Kratz RI, non-polar column, temperature ramp

Column type | Active phase | I | Reference | Comment |
---|---|---|---|---|
Capillary | OV-1 | 1149.6 | Gautzsch and Zinn, 1996 | 8. K/min; Tstart: 35. C; Tend: 300. C |

References

Farrell and Newton, 1965
Farrell, P.G.; Newton, J.,
Ionization potentials of aromatic amines,
J. Phys. Chem., 1965, 69, 3506. [all data]
Rozeboom, Houk, et al., 1982
Rozeboom, M.D.; Houk, K.N.; Searles, S.; Seyedrezai, S.E.,
Photoelectron spectroscopy of N-aryl cyclic amines. Variable conformations and relationships to gas- and solution-phase basicities,
J. Am. Chem. Soc., 1982, 104, 3448. [all data]
Still, Evans, et al., 1972
Still, R.H.; Evans, M.B.; Whitehead, A.,
Thermal Degradation of Polymers. V. Vacuum Pyrolysis of Poly (p-N,N-dimethylaminostyrene) . The Products Volatile at Pyrolysis Temperature, Liquid or Gaseous at Room Temperature,
J. Appl. Polym. Sci., 1972, 16, 12, 3207-3221, https://doi.org/10.1002/app.1972.070161213
. [all data]
Gautzsch and Zinn, 1996
Gautzsch, R.; Zinn, P.,
Use of incremental models to estimate the retention indexes of aromatic compounds,
Chromatographia, 1996, 43, 3/4, 163-176, https://doi.org/10.1007/BF02292946
. [all data]